{"text_format":"2","workbook":"xlsx","n_sheets":3,"sheets":["LeaderBoard","Очки","Лист3"],"not_rendered":{"charts":0,"images":0,"macros":0,"external_links":0,"defined_names":0,"comments":0,"pivot_tables":0},"unopened":[],"bounds":{"document_bytes":16777216,"sheet_cells":100000,"run_cost":"one","rows_first":2000,"rows_last":500,"rows_between":2000,"halvings":0,"cell_chars":16384,"cell_head_chars":4096},"cells_cut":0,"cells_raw":0,"read":"whole","date_system":"1900"}

{"sheet":"LeaderBoard","index":0,"n_rows":39,"n_cols":20,"rows_kept":39,"cut":false,"hidden":false,"merged":[[21,18,23,18],[21,19,23,19],[0,2,0,17],[2,2,2,17],[0,1,2,1],[0,0,2,0],[21,0,23,0],[21,1,23,1],[21,2,21,17],[23,2,23,17]]}
["№ п.п","Участник","Событие"]
[null,null,"8game 06-L","NL 5CD 11-L","NL O8 21-L","2-7 TD 25-L","St8 28-L","PL O8 34-L","HORSE 37-L","NL O8 45-L","StH 49-L","NL 2-7 51-L","PL O8 53-L","HORSE 56-L","L O8 61-L","L Razz 63-L","8game 65-L","NL O8 71-L"]
[null,null,"Место"]
[1,null,6,77,190,1050,2000,3,47,399,111,55,888,444,1,2343,105,57]
[2,null,0]
[3]
[4]
[5]
[6]
[7]
[8]
[9]
[10]
[11]
[12]
[13]
[14]
[15]
[]
[]
[]
["№ п.п","Участник","Событие",{"$nulls":15},"Итого очков","Итого Лучшие 12 результатов"]
[null,null,"8game 06-L","NL 5CD 11-L","NL O8 21-L","2-7 TD 25-L","St8 28-L","PL O8 34-L","HORSE 37-L","NL O8 45-L","StH 49-L","NL 2-7 51-L","PL O8 53-L","HORSE 56-L","L O8 61-L","L Razz 63-L","8game 65-L","NL O8 71-L"]
[null,null,"Очки в зачет"]
[1,null,{"$f":"VLOOKUP(C4,Очки!$A$2:$B$26550,2,FALSE)","v":50},{"$f":"VLOOKUP(D4,Очки!$A$2:$B$26550,2,FALSE)","v":20},{"$f":"VLOOKUP(E4,Очки!$A$2:$B$26550,2,FALSE)","v":20},{"$f":"VLOOKUP(F4,Очки!$A$2:$B$26550,2,FALSE)","v":2},{"$f":"VLOOKUP(G4,Очки!$A$2:$B$26550,2,FALSE)","v":2},{"$f":"VLOOKUP(H4,Очки!$A$2:$B$26550,2,FALSE)","v":70},{"$f":"VLOOKUP(I4,Очки!$A$2:$B$26550,2,FALSE)","v":20},{"$f":"VLOOKUP(J4,Очки!$A$2:$B$26550,2,FALSE)","v":10},{"$f":"VLOOKUP(K4,Очки!$A$2:$B$26550,2,FALSE)","v":20},{"$f":"VLOOKUP(L4,Очки!$A$2:$B$26550,2,FALSE)","v":20},{"$f":"VLOOKUP(M4,Очки!$A$2:$B$26550,2,FALSE)","v":5},{"$f":"VLOOKUP(N4,Очки!$A$2:$B$26550,2,FALSE)","v":10},{"$f":"VLOOKUP(O4,Очки!$A$2:$B$26550,2,FALSE)","v":100},{"$f":"VLOOKUP(P4,Очки!$A$2:$B$26550,2,FALSE)","v":0},{"$f":"VLOOKUP(Q4,Очки!$A$2:$B$26550,2,FALSE)","v":20},{"$f":"VLOOKUP(R4,Очки!$A$2:$B$26550,2,FALSE)","v":20},{"$f":"SUM(C25:R25)","v":389},{"$f":"LARGE(C25:R25,1)+LARGE(C25:R25,2)+LARGE(C25:R25,3)+LARGE(C25:R25,4)+LARGE(C25:R25,5)+LARGE(C25:R25,6)+LARGE(C25:R25,7)+LARGE(C25:R25,8)+LARGE(C25:R25,9)+LARGE(C25:R25,10)+LARGE(C25:R25,11)+LARGE(C25:R25,12)","v":380}]
[2,null,{"$f":"VLOOKUP(C5,Очки!$A$2:$B$26550,2,FALSE)","v":0},{"$f":"VLOOKUP(D5,Очки!$A$2:$B$26550,2,FALSE)","v":0},{"$f":"VLOOKUP(E5,Очки!$A$2:$B$26550,2,FALSE)","v":0},{"$f":"VLOOKUP(F5,Очки!$A$2:$B$26550,2,FALSE)","v":0},{"$f":"VLOOKUP(G5,Очки!$A$2:$B$26550,2,FALSE)","v":0},{"$f":"VLOOKUP(H5,Очки!$A$2:$B$26550,2,FALSE)","v":0},{"$f":"VLOOKUP(I5,Очки!$A$2:$B$26550,2,FALSE)","v":0},{"$f":"VLOOKUP(J5,Очки!$A$2:$B$26550,2,FALSE)","v":0},{"$f":"VLOOKUP(K5,Очки!$A$2:$B$26550,2,FALSE)","v":0},{"$f":"VLOOKUP(L5,Очки!$A$2:$B$26550,2,FALSE)","v":0},{"$f":"VLOOKUP(M5,Очки!$A$2:$B$26550,2,FALSE)","v":0},{"$f":"VLOOKUP(N5,Очки!$A$2:$B$26550,2,FALSE)","v":0},{"$f":"VLOOKUP(O5,Очки!$A$2:$B$26550,2,FALSE)","v":0},{"$f":"VLOOKUP(P5,Очки!$A$2:$B$26550,2,FALSE)","v":0},{"$f":"VLOOKUP(Q5,Очки!$A$2:$B$26550,2,FALSE)","v":0},{"$f":"VLOOKUP(R5,Очки!$A$2:$B$26550,2,FALSE)","v":0},{"$f":"SUM(C26:R26)","v":0},{"$f":"LARGE(C26:R26,1)+LARGE(C26:R26,2)+LARGE(C26:R26,3)+LARGE(C26:R26,4)+LARGE(C26:R26,5)+LARGE(C26:R26,6)+LARGE(C26:R26,7)+LARGE(C26:R26,8)+LARGE(C26:R26,9)+LARGE(C26:R26,10)+LARGE(C26:R26,11)+LARGE(C26:R26,12)","v":0}]
[3,null,{"$f":"VLOOKUP(C6,Очки!$A$2:$B$26550,2,FALSE)","v":0},{"$f":"VLOOKUP(D6,Очки!$A$2:$B$26550,2,FALSE)","v":0},{"$f":"VLOOKUP(E6,Очки!$A$2:$B$26550,2,FALSE)","v":0},{"$f":"VLOOKUP(F6,Очки!$A$2:$B$26550,2,FALSE)","v":0},{"$f":"VLOOKUP(G6,Очки!$A$2:$B$26550,2,FALSE)","v":0},{"$f":"VLOOKUP(H6,Очки!$A$2:$B$26550,2,FALSE)","v":0},{"$f":"VLOOKUP(I6,Очки!$A$2:$B$26550,2,FALSE)","v":0},{"$f":"VLOOKUP(J6,Очки!$A$2:$B$26550,2,FALSE)","v":0},{"$f":"VLOOKUP(K6,Очки!$A$2:$B$26550,2,FALSE)","v":0},{"$f":"VLOOKUP(L6,Очки!$A$2:$B$26550,2,FALSE)","v":0},{"$f":"VLOOKUP(M6,Очки!$A$2:$B$26550,2,FALSE)","v":0},{"$f":"VLOOKUP(N6,Очки!$A$2:$B$26550,2,FALSE)","v":0},{"$f":"VLOOKUP(O6,Очки!$A$2:$B$26550,2,FALSE)","v":0},{"$f":"VLOOKUP(P6,Очки!$A$2:$B$26550,2,FALSE)","v":0},{"$f":"VLOOKUP(Q6,Очки!$A$2:$B$26550,2,FALSE)","v":0},{"$f":"VLOOKUP(R6,Очки!$A$2:$B$26550,2,FALSE)","v":0},0,0]
[4,null,{"$f":"VLOOKUP(C7,Очки!$A$2:$B$26550,2,FALSE)","v":0},{"$f":"VLOOKUP(D7,Очки!$A$2:$B$26550,2,FALSE)","v":0},{"$f":"VLOOKUP(E7,Очки!$A$2:$B$26550,2,FALSE)","v":0},{"$f":"VLOOKUP(F7,Очки!$A$2:$B$26550,2,FALSE)","v":0},{"$f":"VLOOKUP(G7,Очки!$A$2:$B$26550,2,FALSE)","v":0},{"$f":"VLOOKUP(H7,Очки!$A$2:$B$26550,2,FALSE)","v":0},{"$f":"VLOOKUP(I7,Очки!$A$2:$B$26550,2,FALSE)","v":0},{"$f":"VLOOKUP(J7,Очки!$A$2:$B$26550,2,FALSE)","v":0},{"$f":"VLOOKUP(K7,Очки!$A$2:$B$26550,2,FALSE)","v":0},{"$f":"VLOOKUP(L7,Очки!$A$2:$B$26550,2,FALSE)","v":0},{"$f":"VLOOKUP(M7,Очки!$A$2:$B$26550,2,FALSE)","v":0},{"$f":"VLOOKUP(N7,Очки!$A$2:$B$26550,2,FALSE)","v":0},{"$f":"VLOOKUP(O7,Очки!$A$2:$B$26550,2,FALSE)","v":0},{"$f":"VLOOKUP(P7,Очки!$A$2:$B$26550,2,FALSE)","v":0},{"$f":"VLOOKUP(Q7,Очки!$A$2:$B$26550,2,FALSE)","v":0},{"$f":"VLOOKUP(R7,Очки!$A$2:$B$26550,2,FALSE)","v":0},0,0]
[5,null,{"$f":"VLOOKUP(C8,Очки!$A$2:$B$26550,2,FALSE)","v":0},{"$f":"VLOOKUP(D8,Очки!$A$2:$B$26550,2,FALSE)","v":0},{"$f":"VLOOKUP(E8,Очки!$A$2:$B$26550,2,FALSE)","v":0},{"$f":"VLOOKUP(F8,Очки!$A$2:$B$26550,2,FALSE)","v":0},{"$f":"VLOOKUP(G8,Очки!$A$2:$B$26550,2,FALSE)","v":0},{"$f":"VLOOKUP(H8,Очки!$A$2:$B$26550,2,FALSE)","v":0},{"$f":"VLOOKUP(I8,Очки!$A$2:$B$26550,2,FALSE)","v":0},{"$f":"VLOOKUP(J8,Очки!$A$2:$B$26550,2,FALSE)","v":0},{"$f":"VLOOKUP(K8,Очки!$A$2:$B$26550,2,FALSE)","v":0},{"$f":"VLOOKUP(L8,Очки!$A$2:$B$26550,2,FALSE)","v":0},{"$f":"VLOOKUP(M8,Очки!$A$2:$B$26550,2,FALSE)","v":0},{"$f":"VLOOKUP(N8,Очки!$A$2:$B$26550,2,FALSE)","v":0},{"$f":"VLOOKUP(O8,Очки!$A$2:$B$26550,2,FALSE)","v":0},{"$f":"VLOOKUP(P8,Очки!$A$2:$B$26550,2,FALSE)","v":0},{"$f":"VLOOKUP(Q8,Очки!$A$2:$B$26550,2,FALSE)","v":0},{"$f":"VLOOKUP(R8,Очки!$A$2:$B$26550,2,FALSE)","v":0},0,0]
[6,null,{"$f":"VLOOKUP(C9,Очки!$A$2:$B$26550,2,FALSE)","v":0},{"$f":"VLOOKUP(D9,Очки!$A$2:$B$26550,2,FALSE)","v":0},{"$f":"VLOOKUP(E9,Очки!$A$2:$B$26550,2,FALSE)","v":0},{"$f":"VLOOKUP(F9,Очки!$A$2:$B$26550,2,FALSE)","v":0},{"$f":"VLOOKUP(G9,Очки!$A$2:$B$26550,2,FALSE)","v":0},{"$f":"VLOOKUP(H9,Очки!$A$2:$B$26550,2,FALSE)","v":0},{"$f":"VLOOKUP(I9,Очки!$A$2:$B$26550,2,FALSE)","v":0},{"$f":"VLOOKUP(J9,Очки!$A$2:$B$26550,2,FALSE)","v":0},{"$f":"VLOOKUP(K9,Очки!$A$2:$B$26550,2,FALSE)","v":0},{"$f":"VLOOKUP(L9,Очки!$A$2:$B$26550,2,FALSE)","v":0},{"$f":"VLOOKUP(M9,Очки!$A$2:$B$26550,2,FALSE)","v":0},{"$f":"VLOOKUP(N9,Очки!$A$2:$B$26550,2,FALSE)","v":0},{"$f":"VLOOKUP(O9,Очки!$A$2:$B$26550,2,FALSE)","v":0},{"$f":"VLOOKUP(P9,Очки!$A$2:$B$26550,2,FALSE)","v":0},{"$f":"VLOOKUP(Q9,Очки!$A$2:$B$26550,2,FALSE)","v":0},{"$f":"VLOOKUP(R9,Очки!$A$2:$B$26550,2,FALSE)","v":0},0,0]
[7,null,{"$f":"VLOOKUP(C10,Очки!$A$2:$B$26550,2,FALSE)","v":0},{"$f":"VLOOKUP(D10,Очки!$A$2:$B$26550,2,FALSE)","v":0},{"$f":"VLOOKUP(E10,Очки!$A$2:$B$26550,2,FALSE)","v":0},{"$f":"VLOOKUP(F10,Очки!$A$2:$B$26550,2,FALSE)","v":0},{"$f":"VLOOKUP(G10,Очки!$A$2:$B$26550,2,FALSE)","v":0},{"$f":"VLOOKUP(H10,Очки!$A$2:$B$26550,2,FALSE)","v":0},{"$f":"VLOOKUP(I10,Очки!$A$2:$B$26550,2,FALSE)","v":0},{"$f":"VLOOKUP(J10,Очки!$A$2:$B$26550,2,FALSE)","v":0},{"$f":"VLOOKUP(K10,Очки!$A$2:$B$26550,2,FALSE)","v":0},{"$f":"VLOOKUP(L10,Очки!$A$2:$B$26550,2,FALSE)","v":0},{"$f":"VLOOKUP(M10,Очки!$A$2:$B$26550,2,FALSE)","v":0},{"$f":"VLOOKUP(N10,Очки!$A$2:$B$26550,2,FALSE)","v":0},{"$f":"VLOOKUP(O10,Очки!$A$2:$B$26550,2,FALSE)","v":0},{"$f":"VLOOKUP(P10,Очки!$A$2:$B$26550,2,FALSE)","v":0},{"$f":"VLOOKUP(Q10,Очки!$A$2:$B$26550,2,FALSE)","v":0},{"$f":"VLOOKUP(R10,Очки!$A$2:$B$26550,2,FALSE)","v":0},0,0]
[8,null,{"$f":"VLOOKUP(C11,Очки!$A$2:$B$26550,2,FALSE)","v":0},{"$f":"VLOOKUP(D11,Очки!$A$2:$B$26550,2,FALSE)","v":0},{"$f":"VLOOKUP(E11,Очки!$A$2:$B$26550,2,FALSE)","v":0},{"$f":"VLOOKUP(F11,Очки!$A$2:$B$26550,2,FALSE)","v":0},{"$f":"VLOOKUP(G11,Очки!$A$2:$B$26550,2,FALSE)","v":0},{"$f":"VLOOKUP(H11,Очки!$A$2:$B$26550,2,FALSE)","v":0},{"$f":"VLOOKUP(I11,Очки!$A$2:$B$26550,2,FALSE)","v":0},{"$f":"VLOOKUP(J11,Очки!$A$2:$B$26550,2,FALSE)","v":0},{"$f":"VLOOKUP(K11,Очки!$A$2:$B$26550,2,FALSE)","v":0},{"$f":"VLOOKUP(L11,Очки!$A$2:$B$26550,2,FALSE)","v":0},{"$f":"VLOOKUP(M11,Очки!$A$2:$B$26550,2,FALSE)","v":0},{"$f":"VLOOKUP(N11,Очки!$A$2:$B$26550,2,FALSE)","v":0},{"$f":"VLOOKUP(O11,Очки!$A$2:$B$26550,2,FALSE)","v":0},{"$f":"VLOOKUP(P11,Очки!$A$2:$B$26550,2,FALSE)","v":0},{"$f":"VLOOKUP(Q11,Очки!$A$2:$B$26550,2,FALSE)","v":0},{"$f":"VLOOKUP(R11,Очки!$A$2:$B$26550,2,FALSE)","v":0},0,0]
[9,null,{"$f":"VLOOKUP(C12,Очки!$A$2:$B$26550,2,FALSE)","v":0},{"$f":"VLOOKUP(D12,Очки!$A$2:$B$26550,2,FALSE)","v":0},{"$f":"VLOOKUP(E12,Очки!$A$2:$B$26550,2,FALSE)","v":0},{"$f":"VLOOKUP(F12,Очки!$A$2:$B$26550,2,FALSE)","v":0},{"$f":"VLOOKUP(G12,Очки!$A$2:$B$26550,2,FALSE)","v":0},{"$f":"VLOOKUP(H12,Очки!$A$2:$B$26550,2,FALSE)","v":0},{"$f":"VLOOKUP(I12,Очки!$A$2:$B$26550,2,FALSE)","v":0},{"$f":"VLOOKUP(J12,Очки!$A$2:$B$26550,2,FALSE)","v":0},{"$f":"VLOOKUP(K12,Очки!$A$2:$B$26550,2,FALSE)","v":0},{"$f":"VLOOKUP(L12,Очки!$A$2:$B$26550,2,FALSE)","v":0},{"$f":"VLOOKUP(M12,Очки!$A$2:$B$26550,2,FALSE)","v":0},{"$f":"VLOOKUP(N12,Очки!$A$2:$B$26550,2,FALSE)","v":0},{"$f":"VLOOKUP(O12,Очки!$A$2:$B$26550,2,FALSE)","v":0},{"$f":"VLOOKUP(P12,Очки!$A$2:$B$26550,2,FALSE)","v":0},{"$f":"VLOOKUP(Q12,Очки!$A$2:$B$26550,2,FALSE)","v":0},{"$f":"VLOOKUP(R12,Очки!$A$2:$B$26550,2,FALSE)","v":0},0,0]
[10,null,{"$f":"VLOOKUP(C13,Очки!$A$2:$B$26550,2,FALSE)","v":0},{"$f":"VLOOKUP(D13,Очки!$A$2:$B$26550,2,FALSE)","v":0},{"$f":"VLOOKUP(E13,Очки!$A$2:$B$26550,2,FALSE)","v":0},{"$f":"VLOOKUP(F13,Очки!$A$2:$B$26550,2,FALSE)","v":0},{"$f":"VLOOKUP(G13,Очки!$A$2:$B$26550,2,FALSE)","v":0},{"$f":"VLOOKUP(H13,Очки!$A$2:$B$26550,2,FALSE)","v":0},{"$f":"VLOOKUP(I13,Очки!$A$2:$B$26550,2,FALSE)","v":0},{"$f":"VLOOKUP(J13,Очки!$A$2:$B$26550,2,FALSE)","v":0},{"$f":"VLOOKUP(K13,Очки!$A$2:$B$26550,2,FALSE)","v":0},{"$f":"VLOOKUP(L13,Очки!$A$2:$B$26550,2,FALSE)","v":0},{"$f":"VLOOKUP(M13,Очки!$A$2:$B$26550,2,FALSE)","v":0},{"$f":"VLOOKUP(N13,Очки!$A$2:$B$26550,2,FALSE)","v":0},{"$f":"VLOOKUP(O13,Очки!$A$2:$B$26550,2,FALSE)","v":0},{"$f":"VLOOKUP(P13,Очки!$A$2:$B$26550,2,FALSE)","v":0},{"$f":"VLOOKUP(Q13,Очки!$A$2:$B$26550,2,FALSE)","v":0},{"$f":"VLOOKUP(R13,Очки!$A$2:$B$26550,2,FALSE)","v":0},0,0]
[11,null,{"$f":"VLOOKUP(C14,Очки!$A$2:$B$26550,2,FALSE)","v":0},{"$f":"VLOOKUP(D14,Очки!$A$2:$B$26550,2,FALSE)","v":0},{"$f":"VLOOKUP(E14,Очки!$A$2:$B$26550,2,FALSE)","v":0},{"$f":"VLOOKUP(F14,Очки!$A$2:$B$26550,2,FALSE)","v":0},{"$f":"VLOOKUP(G14,Очки!$A$2:$B$26550,2,FALSE)","v":0},{"$f":"VLOOKUP(H14,Очки!$A$2:$B$26550,2,FALSE)","v":0},{"$f":"VLOOKUP(I14,Очки!$A$2:$B$26550,2,FALSE)","v":0},{"$f":"VLOOKUP(J14,Очки!$A$2:$B$26550,2,FALSE)","v":0},{"$f":"VLOOKUP(K14,Очки!$A$2:$B$26550,2,FALSE)","v":0},{"$f":"VLOOKUP(L14,Очки!$A$2:$B$26550,2,FALSE)","v":0},{"$f":"VLOOKUP(M14,Очки!$A$2:$B$26550,2,FALSE)","v":0},{"$f":"VLOOKUP(N14,Очки!$A$2:$B$26550,2,FALSE)","v":0},{"$f":"VLOOKUP(O14,Очки!$A$2:$B$26550,2,FALSE)","v":0},{"$f":"VLOOKUP(P14,Очки!$A$2:$B$26550,2,FALSE)","v":0},{"$f":"VLOOKUP(Q14,Очки!$A$2:$B$26550,2,FALSE)","v":0},{"$f":"VLOOKUP(R14,Очки!$A$2:$B$26550,2,FALSE)","v":0},0,0]
[12,null,{"$f":"VLOOKUP(C15,Очки!$A$2:$B$26550,2,FALSE)","v":0},{"$f":"VLOOKUP(D15,Очки!$A$2:$B$26550,2,FALSE)","v":0},{"$f":"VLOOKUP(E15,Очки!$A$2:$B$26550,2,FALSE)","v":0},{"$f":"VLOOKUP(F15,Очки!$A$2:$B$26550,2,FALSE)","v":0},{"$f":"VLOOKUP(G15,Очки!$A$2:$B$26550,2,FALSE)","v":0},{"$f":"VLOOKUP(H15,Очки!$A$2:$B$26550,2,FALSE)","v":0},{"$f":"VLOOKUP(I15,Очки!$A$2:$B$26550,2,FALSE)","v":0},{"$f":"VLOOKUP(J15,Очки!$A$2:$B$26550,2,FALSE)","v":0},{"$f":"VLOOKUP(K15,Очки!$A$2:$B$26550,2,FALSE)","v":0},{"$f":"VLOOKUP(L15,Очки!$A$2:$B$26550,2,FALSE)","v":0},{"$f":"VLOOKUP(M15,Очки!$A$2:$B$26550,2,FALSE)","v":0},{"$f":"VLOOKUP(N15,Очки!$A$2:$B$26550,2,FALSE)","v":0},{"$f":"VLOOKUP(O15,Очки!$A$2:$B$26550,2,FALSE)","v":0},{"$f":"VLOOKUP(P15,Очки!$A$2:$B$26550,2,FALSE)","v":0},{"$f":"VLOOKUP(Q15,Очки!$A$2:$B$26550,2,FALSE)","v":0},{"$f":"VLOOKUP(R15,Очки!$A$2:$B$26550,2,FALSE)","v":0},0,0]
[13,null,{"$f":"VLOOKUP(C16,Очки!$A$2:$B$26550,2,FALSE)","v":0},{"$f":"VLOOKUP(D16,Очки!$A$2:$B$26550,2,FALSE)","v":0},{"$f":"VLOOKUP(E16,Очки!$A$2:$B$26550,2,FALSE)","v":0},{"$f":"VLOOKUP(F16,Очки!$A$2:$B$26550,2,FALSE)","v":0},{"$f":"VLOOKUP(G16,Очки!$A$2:$B$26550,2,FALSE)","v":0},{"$f":"VLOOKUP(H16,Очки!$A$2:$B$26550,2,FALSE)","v":0},{"$f":"VLOOKUP(I16,Очки!$A$2:$B$26550,2,FALSE)","v":0},{"$f":"VLOOKUP(J16,Очки!$A$2:$B$26550,2,FALSE)","v":0},{"$f":"VLOOKUP(K16,Очки!$A$2:$B$26550,2,FALSE)","v":0},{"$f":"VLOOKUP(L16,Очки!$A$2:$B$26550,2,FALSE)","v":0},{"$f":"VLOOKUP(M16,Очки!$A$2:$B$26550,2,FALSE)","v":0},{"$f":"VLOOKUP(N16,Очки!$A$2:$B$26550,2,FALSE)","v":0},{"$f":"VLOOKUP(O16,Очки!$A$2:$B$26550,2,FALSE)","v":0},{"$f":"VLOOKUP(P16,Очки!$A$2:$B$26550,2,FALSE)","v":0},{"$f":"VLOOKUP(Q16,Очки!$A$2:$B$26550,2,FALSE)","v":0},{"$f":"VLOOKUP(R16,Очки!$A$2:$B$26550,2,FALSE)","v":0},0,0]
[14,null,{"$f":"VLOOKUP(C17,Очки!$A$2:$B$26550,2,FALSE)","v":0},{"$f":"VLOOKUP(D17,Очки!$A$2:$B$26550,2,FALSE)","v":0},{"$f":"VLOOKUP(E17,Очки!$A$2:$B$26550,2,FALSE)","v":0},{"$f":"VLOOKUP(F17,Очки!$A$2:$B$26550,2,FALSE)","v":0},{"$f":"VLOOKUP(G17,Очки!$A$2:$B$26550,2,FALSE)","v":0},{"$f":"VLOOKUP(H17,Очки!$A$2:$B$26550,2,FALSE)","v":0},{"$f":"VLOOKUP(I17,Очки!$A$2:$B$26550,2,FALSE)","v":0},{"$f":"VLOOKUP(J17,Очки!$A$2:$B$26550,2,FALSE)","v":0},{"$f":"VLOOKUP(K17,Очки!$A$2:$B$26550,2,FALSE)","v":0},{"$f":"VLOOKUP(L17,Очки!$A$2:$B$26550,2,FALSE)","v":0},{"$f":"VLOOKUP(M17,Очки!$A$2:$B$26550,2,FALSE)","v":0},{"$f":"VLOOKUP(N17,Очки!$A$2:$B$26550,2,FALSE)","v":0},{"$f":"VLOOKUP(O17,Очки!$A$2:$B$26550,2,FALSE)","v":0},{"$f":"VLOOKUP(P17,Очки!$A$2:$B$26550,2,FALSE)","v":0},{"$f":"VLOOKUP(Q17,Очки!$A$2:$B$26550,2,FALSE)","v":0},{"$f":"VLOOKUP(R17,Очки!$A$2:$B$26550,2,FALSE)","v":0},0,0]
[15,null,{"$f":"VLOOKUP(C18,Очки!$A$2:$B$26550,2,FALSE)","v":0},{"$f":"VLOOKUP(D18,Очки!$A$2:$B$26550,2,FALSE)","v":0},{"$f":"VLOOKUP(E18,Очки!$A$2:$B$26550,2,FALSE)","v":0},{"$f":"VLOOKUP(F18,Очки!$A$2:$B$26550,2,FALSE)","v":0},{"$f":"VLOOKUP(G18,Очки!$A$2:$B$26550,2,FALSE)","v":0},{"$f":"VLOOKUP(H18,Очки!$A$2:$B$26550,2,FALSE)","v":0},{"$f":"VLOOKUP(I18,Очки!$A$2:$B$26550,2,FALSE)","v":0},{"$f":"VLOOKUP(J18,Очки!$A$2:$B$26550,2,FALSE)","v":0},{"$f":"VLOOKUP(K18,Очки!$A$2:$B$26550,2,FALSE)","v":0},{"$f":"VLOOKUP(L18,Очки!$A$2:$B$26550,2,FALSE)","v":0},{"$f":"VLOOKUP(M18,Очки!$A$2:$B$26550,2,FALSE)","v":0},{"$f":"VLOOKUP(N18,Очки!$A$2:$B$26550,2,FALSE)","v":0},{"$f":"VLOOKUP(O18,Очки!$A$2:$B$26550,2,FALSE)","v":0},{"$f":"VLOOKUP(P18,Очки!$A$2:$B$26550,2,FALSE)","v":0},{"$f":"VLOOKUP(Q18,Очки!$A$2:$B$26550,2,FALSE)","v":0},{"$f":"VLOOKUP(R18,Очки!$A$2:$B$26550,2,FALSE)","v":0},0,0]

{"sheet":"Очки","index":1,"n_rows":26550,"n_cols":2,"rows_kept":26550,"cut":false,"hidden":false,"merged":[]}
["Место","Очки"]
[0,0]
[1,100]
[2,80]
[3,70]
[4,60]
[5,55]
[6,50]
[7,45]
[8,40]
[9,35]
[10,30]
[11,30]
[12,30]
[13,30]
[14,30]
[15,30]
[16,30]
[17,30]
[18,30]
[19,30]
[20,30]
[21,25]
[22,25]
[23,25]
[24,25]
[25,25]
[26,25]
[27,25]
[28,25]
[29,25]
[30,25]
[31,25]
[32,25]
[33,25]
[34,25]
[35,25]
[36,25]
[37,25]
[38,25]
[39,25]
[40,25]
[41,20]
[42,20]
[43,20]
[44,20]
[45,20]
[46,20]
[47,20]
[48,20]
[49,20]
[50,20]
[51,20]
[52,20]
[53,20]
[54,20]
[55,20]
[56,20]
[57,20]
[58,20]
[59,20]
[60,20]
[61,20]
[62,20]
[63,20]
[64,20]
[65,20]
[66,20]
[67,20]
[68,20]
[69,20]
[70,20]
[71,20]
[72,20]
[73,20]
[74,20]
[75,20]
[76,20]
[77,20]
[78,20]
[79,20]
[80,20]
[81,20]
[82,20]
[83,20]
[84,20]
[85,20]
[86,20]
[87,20]
[88,20]
[89,20]
[90,20]
[91,20]
[92,20]
[93,20]
[94,20]
[95,20]
[96,20]
[97,20]
[98,20]
[99,20]
[100,20]
[101,20]
[102,20]
[103,20]
[104,20]
[105,20]
[106,20]
[107,20]
[108,20]
[109,20]
[110,20]
[111,20]
[112,20]
[113,20]
[114,20]
[115,20]
[116,20]
[117,20]
[118,20]
[119,20]
[120,20]
[121,20]
[122,20]
[123,20]
[124,20]
[125,20]
[126,20]
[127,20]
[128,20]
[129,20]
[130,20]
[131,20]
[132,20]
[133,20]
[134,20]
[135,20]
[136,20]
[137,20]
[138,20]
[139,20]
[140,20]
[141,20]
[142,20]
[143,20]
[144,20]
[145,20]
[146,20]
[147,20]
[148,20]
[149,20]
[150,20]
[151,20]
[152,20]
[153,20]
[154,20]
[155,20]
[156,20]
[157,20]
[158,20]
[159,20]
[160,20]
[161,20]
[162,20]
[163,20]
[164,20]
[165,20]
[166,20]
[167,20]
[168,20]
[169,20]
[170,20]
[171,20]
[172,20]
[173,20]
[174,20]
[175,20]
[176,20]
[177,20]
[178,20]
[179,20]
[180,20]
[181,20]
[182,20]
[183,20]
[184,20]
[185,20]
[186,20]
[187,20]
[188,20]
[189,20]
[190,20]
[191,20]
[192,20]
[193,20]
[194,20]
[195,20]
[196,20]
[197,20]
[198,20]
[199,20]
[200,20]
[201,10]
[202,10]
[203,10]
[204,10]
[205,10]
[206,10]
[207,10]
[208,10]
[209,10]
[210,10]
[211,10]
[212,10]
[213,10]
[214,10]
[215,10]
[216,10]
[217,10]
[218,10]
[219,10]
[220,10]
[221,10]
[222,10]
[223,10]
[224,10]
[225,10]
[226,10]
[227,10]
[228,10]
[229,10]
[230,10]
[231,10]
[232,10]
[233,10]
[234,10]
[235,10]
[236,10]
[237,10]
[238,10]
[239,10]
[240,10]
[241,10]
[242,10]
[243,10]
[244,10]
[245,10]
[246,10]
[247,10]
[248,10]
[249,10]
[250,10]
[251,10]
[252,10]
[253,10]
[254,10]
[255,10]
[256,10]
[257,10]
[258,10]
[259,10]
[260,10]
[261,10]
[262,10]
[263,10]
[264,10]
[265,10]
[266,10]
[267,10]
[268,10]
[269,10]
[270,10]
[271,10]
[272,10]
[273,10]
[274,10]
[275,10]
[276,10]
[277,10]
[278,10]
[279,10]
[280,10]
[281,10]
[282,10]
[283,10]
[284,10]
[285,10]
[286,10]
[287,10]
[288,10]
[289,10]
[290,10]
[291,10]
[292,10]
[293,10]
[294,10]
[295,10]
[296,10]
[297,10]
[298,10]
[299,10]
[300,10]
[301,10]
[302,10]
[303,10]
[304,10]
[305,10]
[306,10]
[307,10]
[308,10]
[309,10]
[310,10]
[311,10]
[312,10]
[313,10]
[314,10]
[315,10]
[316,10]
[317,10]
[318,10]
[319,10]
[320,10]
[321,10]
[322,10]
[323,10]
[324,10]
[325,10]
[326,10]
[327,10]
[328,10]
[329,10]
[330,10]
[331,10]
[332,10]
[333,10]
[334,10]
[335,10]
[336,10]
[337,10]
[338,10]
[339,10]
[340,10]
[341,10]
[342,10]
[343,10]
[344,10]
[345,10]
[346,10]
[347,10]
[348,10]
[349,10]
[350,10]
[351,10]
[352,10]
[353,10]
[354,10]
[355,10]
[356,10]
[357,10]
[358,10]
[359,10]
[360,10]
[361,10]
[362,10]
[363,10]
[364,10]
[365,10]
[366,10]
[367,10]
[368,10]
[369,10]
[370,10]
[371,10]
[372,10]
[373,10]
[374,10]
[375,10]
[376,10]
[377,10]
[378,10]
[379,10]
[380,10]
[381,10]
[382,10]
[383,10]
[384,10]
[385,10]
[386,10]
[387,10]
[388,10]
[389,10]
[390,10]
[391,10]
[392,10]
[393,10]
[394,10]
[395,10]
[396,10]
[397,10]
[398,10]
{"$rows_left_out":26151}
{"sheet":"Лист3","index":2,"n_rows":0,"n_cols":0,"rows_kept":0,"cut":false,"hidden":false,"merged":[]}