{"text_format":"2","workbook":"xlsx","n_sheets":9,"sheets":[".","Game","HM","BAZA()","день","неделя","деньнед","buy-in","месяц"],"not_rendered":{"charts":0,"images":0,"macros":0,"external_links":1,"defined_names":48,"comments":0,"pivot_tables":4},"unopened":[],"bounds":{"document_bytes":16777216,"sheet_cells":100000,"run_cost":"one","rows_first":2000,"rows_last":500,"rows_between":2000,"halvings":0,"cell_chars":16384,"cell_head_chars":4096},"cells_cut":0,"cells_raw":0,"read":"whole","date_system":"1900"}

{"sheet":".","index":0,"n_rows":89,"n_cols":8,"rows_kept":89,"cut":false,"hidden":false,"merged":[]}
["Room","PS",null,"Room","ES",null,"Room","PAC"]
["Date","(Все)",null,"Date","(Все)",null,"Date","(Все)"]
["Name","(Все)",null,"Name","(Все)",null,"Name","(Все)"]
["Buy-In","(несколько элементов)",null,"Buy-In","(несколько элементов)",null,"Buy-In","(Все)"]
[]
["Названия строк",null,null,"Названия строк",null,null,"Названия строк"]
["00:20 1,1 Gtd PS Friz  Regular 9",null,null,"22:25 1 Bubble Rush ES Friz  Turbo 9",null,null,"14:30 3,3 Gtd PAC Friz  Regular 9"]
["05:00 4,4 Big PS Friz  Regular 9",null,null,"22:00 1 Daily Micro ES Friz  Regular 9",null,null,"14:00 2,2 Gtd PAC Friz  Regular 9"]
["05:10 2,2 Deep Stacks PS Friz  Regular 9",null,null,"19:15 1 SuperStack ES Friz  Regular 6",null,null,"12:30 1 Gtd PAC Friz  Regular 9"]
["06:05 4,4 Progressive KO PS KO  Regular 9",null,null,"19:00 1 Deep Stacks ES Friz  Regular 6",null,null,"10:00 3 Gtd PAC Friz  Regular 9"]
["06:15 1,1 Hot PS Friz  Turbo 9",null,null,"18:45 1 Gtd ES Friz  Regular 6",null,null,"09:15 1,5 Gtd R/A PAC Friz  Regular 6"]
["07:00 2,2 Big PS Friz  Regular 9",null,null,"16:45 1 SuperStack ES Friz  Regular 6",null,null,"18:00 3 Mini Swordfish PAC Friz  Regular 9"]
["07:00 3,3 Progressive KO PS KO  Turbo 9",null,null,"17:40 1 Gtd ES Friz  Regular 9",null,null,"17:00 2,2 Gtd R/A PAC Friz  Regular 9"]
["07:15 11 Progressive KO PS KO  Regular 9",null,null,"13:00 1 Hot ES Friz  Turbo 9",null,null,"17:00 5,5 Big Fish PAC Friz  Regular 9"]
["07:30 5,5 Bounty Builder PS KO  Regular 9",null,null,"11:50 1 Gtd ES Friz  Regular 9",null,null,"16:30 2,2 Gtd PAC Friz  Regular 9"]
["08:00 3,3 Progressive KO PS KO  Turbo 9",null,null,"11:30 1 SuperStack ES Friz  Regular 6",null,null,"07:45 3,3 Gtd PAC Friz  Regular 9"]
["08:10 5,5 Deep Stacks PS Friz  Regular 9",null,null,"10:30 1 Gtd ES Friz  Regular 9",null,null,"07:15 5 Gtd PAC Friz  Regular 9"]
["08:30 2,2 Gtd PS Friz  Regular 9",null,null,"09:40 1 Gtd ES Friz  Turbo 9",null,null,"09:30 12 Catfish PAC Friz  Regular 9"]
["09:00 1,1 Progressive KO PS KO  Turbo 9",null,null,"09:30 1 Gtd ES Friz  Regular 9",null,null,"05:30 5 Gtd PAC Friz  Regular 8"]
["09:20 7,5 Progressive KO PS KO  Regular 9",null,null,"17:20 1 Gtd ES Friz  Turbo 9",null,null,"11:00 12 Catfish PAC Friz  Regular 10"]
["09:30 3,3 Bounty Builder PS KO  Regular 9",null,null,"11:30 3 Gtd ES Friz  Regular 9",null,null,"12:00 11 Progressive KO PAC KO  Regular 9"]
["09:45 1,1 Zoom R/A PS Friz  Turbo 9",null,null,"10:40 1 Gtd R/A ES Friz  Turbo 9",null,null,"12:45 5,5 Progressive KO PAC KO  Regular 9"]
["10:00 1,1 Deep Payouts PS Friz  Regular 9",null,null,"08:05 2 Gtd ES Friz  Regular 9",null,null,"13:30 4,4 Progressive KO PAC KO  Regular 9"]
["10:20 2,2 Progressive KO PS KO  Turbo 9",null,null,"07:00 3 Gtd ES Friz  Regular 9"]
["10:25 1,1 Bubble Rush PS Friz  Turbo 9",null,null,"21:15 2 Big ES Friz  Regular 9"]
["10:45 1,1 Zoom PS Friz  Turbo 9",null,null,"20:15 3 SuperStack ES Friz  Regular 6"]
["11:15 7,5 Deep Stacks PS Friz  Regular 9",null,null,"18:15 3 Big ES Friz  Regular 9"]
["11:20 1,1 Gtd R/A PS Friz  Regular 9",null,null,"15:30 1 Storm R/A ES Friz  Regular 9"]
["11:40 3,3 Gtd PS Friz  Regular 9",null,null,"15:15 3 SuperStack ES Friz  Regular 6"]
["11:45 1,1 Gtd PS Friz  Turbo 6",null,null,"12:30 3 Progressive KO ES KO  Regular 9"]
["11:50 2,2 Bubble Rush PS Friz  Turbo 9"]
["12:00 1,1 Big PS Friz  Regular 9"]
["12:15 3,3 Hot PS Friz  Turbo 9"]
["12:30 1,1 MicroMillions PS Friz  Regular 8"]
["12:30 1,1 MicroMillions PS Friz  Regular 9"]
["12:30 3,3 MicroMillions PS KO  Regular 9"]
["12:30 5,5 MicroMillions PS Friz  Regular 9"]
["12:40 1,1 Progressive KO PS KO  Turbo 9"]
["13:00 2,2 Gtd PS Friz  Regular 6"]
["13:30 4,4 Bounty Builder PS KO  Regular 9"]
["13:45 2,2 Deep Stacks PS Friz  Regular 9"]
["13:50 2,2 Gtd PS Friz  Turbo 9"]
["14:00 1,1 Satellite PS Friz  Regular 8"]
["14:05 4,4 Gtd PS Friz  Regular 8"]
["14:10 5,5 Win the Button PS Friz  Regular 9"]
["14:20 1,1 Progressive KO PS KO  Regular 9"]
["14:30 1,1 Splash R/a PS Friz  Turbo 9"]
["14:45 2,2 Gtd PS Friz  Regular 6"]
["15:00 1,1 Gtd PS Friz  Regular 9"]
["15:00 3,3 Saturday Micro PS Friz  Regular 9"]
["15:40 3,3 Deep Payouts PS Friz  Turbo 9"]
["16:00 4,4 Big PS Friz  Regular 9"]
["16:15 1,1 Gtd PS Friz  Regular 9"]
["16:20 5,5 Progressive KO PS KO  Regular 6"]
["16:25 2,2 Player Cap PS Friz  Regular 9"]
["16:30 1,1 MicroMillions PS KO  Turbo 6"]
["16:30 5,5 MicroMillions PS KO  Regular 9"]
["16:30 5,5 Mini Daily Marathon PS Friz  Regular 9"]
["16:40 3,3 Gtd PS Friz  Regular 6"]
["17:10 2,2 Gtd PS Friz  Regular 8"]
["17:15 1,1 Progressive KO PS KO  Turbo 9"]
["17:15 3,3 Mini Sunday Rebuy PS Friz  Regular 9"]
["17:40 1,1 Gtd PS Friz  Regular 9"]
["18:00 1,1 Satellite PS Friz  Regular 8"]
["18:15 3,3 Player Cap PS Friz  Regular 9"]
["18:30 2,2 Bounty Builder PS KO  Regular 9"]
["18:40 1,1 Zoom PS Friz  Turbo 9"]
["19:00 3,3 Big PS Friz  Regular 9"]
["19:15 2,2 Gtd PS Friz  Turbo 9"]
["19:25 1,1 Gtd PS Friz  Regular 6"]
["20:00 1,1 Big PS Friz  Regular 9"]
["20:00 1,1 MicroMillions PS Friz  Turbo 9"]
["20:30 3,3 Bounty Builder PS KO  Regular 9"]
["21:00 2,2 Micro Fast Friday PS Friz  Turbo 8"]
["21:00 22 MicroMillions PS Friz  Regular 8"]
["21:05 11 Sunday Storm PS Friz  Regular 9"]
["21:10 3,3 Player Cap PS Friz  Regular 9"]
["21:15 1,1 Splash R/a PS Friz  Turbo 9"]
["21:15 2,2 Hot PS Friz  Turbo 9"]
["21:30 1,1 Bounty Builder PS KO  Regular 9"]
["21:40 3,3 Zoom PS Friz  Turbo 9"]
["22:00 2,2 Big PS Friz  Regular 9"]
["22:15 3,3 Hot PS Friz  Turbo 9"]
["22:30 1,1 Player Cap PS Friz  Regular 9"]
["22:50 3,3 Gtd PS Friz  Regular 6"]
["23:10 2,2 Deep Stacks PS Friz  Regular 9"]
["23:15 1,1 Hot PS Friz  Turbo 9"]
["23:30 2,2 Bounty Builder PS KO  Regular 9"]
["23:40 3,3 Gtd PS Friz  Regular 8"]

{"sheet":"Game","index":1,"n_rows":150,"n_cols":20,"rows_kept":150,"cut":false,"hidden":false,"merged":[[5,4,5,10]]}
[null,"Room","(Все)"]
[null,"Meset","(Все)"]
[null,"Date","(Все)"]
[null,"Buy-In","(Все)"]
[]
[null,"Названия строк",null,null,"Name",{"$nulls":6},"Games","Buy-in","Roi","Itm","Hand","bb/100","EV bb/100","Profit","Pr/Game"]
[null,"00:00 0,25 45 Max PS Friz  Regular 9",null,null,{"$f":"IFERROR(IF(VLOOKUP($B7,Таблица1[],9,0)=0,\"\",VLOOKUP($B7,Таблица1[],9,0)),\"\")","v":""},{"$f":"IFERROR(VLOOKUP($B7,Таблица1[],16,0),\"\")","v":0.25},{"$f":"IFERROR(VLOOKUP($B7,Таблица1[],10,0),\"\")","v":"45 Max"},{"$f":"IFERROR(VLOOKUP($B7,Таблица1[],11,0),\"\")","v":"PS"},{"$f":"IFERROR(VLOOKUP($B7,Таблица1[],12,0),\"\")","v":"Friz"},{"$f":"IFERROR(VLOOKUP($B7,Таблица1[],13,0),\"\")","v":"Regular"},{"$f":"IFERROR(VLOOKUP($B7,Таблица1[],14,0),\"\")","v":9},{"$f":"COUNTIFS(Таблица1[2019],B7)+SUMIFS(Таблица1[Re-entry],Таблица1[2019],B7)","v":4},{"$f":"SUMIFS(Таблица1[Total Buy-In],Таблица1[2019],B7)","v":1},{"$f":"IFERROR((S7/M7)*100,0)","v":223},{"$f":"IFERROR(COUNTIFS(Таблица1[2019],B7,Таблица1[Winnings],\">0\")/L7*100,0)","v":25},{"$f":"SUMIFS(Таблица1[Total Hands],Таблица1[2019],B7)","v":416},{"$f":"IFERROR(SUMIFS(Таблица1[bb/101],Таблица1[2019],B7)/P7,0)","v":18.658221153846153},{"$f":"IFERROR(SUMIFS(Таблица1[EV bb/101],Таблица1[2019],B7)/P7,0)","v":5.9914182692307678},{"$f":"SUMIFS(Таблица1[Net Winnings],Таблица1[2019],B7)","v":2.23},{"$f":"IFERROR(S7/L7,0)","v":0.5575}]
[null,"00:00 0,5 45 Max PS Friz  Turbo 9",null,null,{"$f":"IFERROR(IF(VLOOKUP($B8,Таблица1[],9,0)=0,\"\",VLOOKUP($B8,Таблица1[],9,0)),\"\")","v":""},{"$f":"IFERROR(VLOOKUP($B8,Таблица1[],16,0),\"\")","v":""},{"$f":"IFERROR(VLOOKUP($B8,Таблица1[],10,0),\"\")","v":""},{"$f":"IFERROR(VLOOKUP($B8,Таблица1[],11,0),\"\")","v":""},{"$f":"IFERROR(VLOOKUP($B8,Таблица1[],12,0),\"\")","v":""},{"$f":"IFERROR(VLOOKUP($B8,Таблица1[],13,0),\"\")","v":""},{"$f":"IFERROR(VLOOKUP($B8,Таблица1[],14,0),\"\")","v":""},{"$f":"COUNTIFS(Таблица1[2019],B8)+SUMIFS(Таблица1[Re-entry],Таблица1[2019],B8)","v":0},{"$f":"SUMIFS(Таблица1[Total Buy-In],Таблица1[2019],B8)","v":0},{"$f":"IFERROR((S8/M8)*100,0)","v":0},{"$f":"IFERROR(COUNTIFS(Таблица1[2019],B8,Таблица1[Winnings],\">0\")/L8*100,0)","v":0},{"$f":"SUMIFS(Таблица1[Total Hands],Таблица1[2019],B8)","v":0},{"$f":"IFERROR(SUMIFS(Таблица1[bb/101],Таблица1[2019],B8)/P8,0)","v":0},{"$f":"IFERROR(SUMIFS(Таблица1[EV bb/101],Таблица1[2019],B8)/P8,0)","v":0},{"$f":"SUMIFS(Таблица1[Net Winnings],Таблица1[2019],B8)","v":0},{"$f":"IFERROR(S8/L8,0)","v":0}]
[null,"00:00 1 180 Max PS Friz  Regular 9",null,null,{"$f":"IFERROR(IF(VLOOKUP($B9,Таблица1[],9,0)=0,\"\",VLOOKUP($B9,Таблица1[],9,0)),\"\")","v":""},{"$f":"IFERROR(VLOOKUP($B9,Таблица1[],16,0),\"\")","v":""},{"$f":"IFERROR(VLOOKUP($B9,Таблица1[],10,0),\"\")","v":""},{"$f":"IFERROR(VLOOKUP($B9,Таблица1[],11,0),\"\")","v":""},{"$f":"IFERROR(VLOOKUP($B9,Таблица1[],12,0),\"\")","v":""},{"$f":"IFERROR(VLOOKUP($B9,Таблица1[],13,0),\"\")","v":""},{"$f":"IFERROR(VLOOKUP($B9,Таблица1[],14,0),\"\")","v":""},{"$f":"COUNTIFS(Таблица1[2019],B9)+SUMIFS(Таблица1[Re-entry],Таблица1[2019],B9)","v":0},{"$f":"SUMIFS(Таблица1[Total Buy-In],Таблица1[2019],B9)","v":0},0,{"$f":"IFERROR(COUNTIFS(Таблица1[2019],B9,Таблица1[Winnings],\">0\")/L9*100,0)","v":0},{"$f":"SUMIFS(Таблица1[Total Hands],Таблица1[2019],B9)","v":0},{"$f":"IFERROR(SUMIFS(Таблица1[bb/101],Таблица1[2019],B9)/P9,0)","v":0},{"$f":"IFERROR(SUMIFS(Таблица1[EV bb/101],Таблица1[2019],B9)/P9,0)","v":0},{"$f":"SUMIFS(Таблица1[Net Winnings],Таблица1[2019],B9)","v":0},0]
[null,"00:00 1 45 Max PS Friz  Regular 9",null,null,{"$f":"IFERROR(IF(VLOOKUP($B10,Таблица1[],9,0)=0,\"\",VLOOKUP($B10,Таблица1[],9,0)),\"\")","v":""},{"$f":"IFERROR(VLOOKUP($B10,Таблица1[],16,0),\"\")","v":""},{"$f":"IFERROR(VLOOKUP($B10,Таблица1[],10,0),\"\")","v":""},{"$f":"IFERROR(VLOOKUP($B10,Таблица1[],11,0),\"\")","v":""},{"$f":"IFERROR(VLOOKUP($B10,Таблица1[],12,0),\"\")","v":""},{"$f":"IFERROR(VLOOKUP($B10,Таблица1[],13,0),\"\")","v":""},{"$f":"IFERROR(VLOOKUP($B10,Таблица1[],14,0),\"\")","v":""},{"$f":"COUNTIFS(Таблица1[2019],B10)+SUMIFS(Таблица1[Re-entry],Таблица1[2019],B10)","v":0},{"$f":"SUMIFS(Таблица1[Total Buy-In],Таблица1[2019],B10)","v":0},0,{"$f":"IFERROR(COUNTIFS(Таблица1[2019],B10,Таблица1[Winnings],\">0\")/L10*100,0)","v":0},{"$f":"SUMIFS(Таблица1[Total Hands],Таблица1[2019],B10)","v":0},{"$f":"IFERROR(SUMIFS(Таблица1[bb/101],Таблица1[2019],B10)/P10,0)","v":0},{"$f":"IFERROR(SUMIFS(Таблица1[EV bb/101],Таблица1[2019],B10)/P10,0)","v":0},{"$f":"SUMIFS(Таблица1[Net Winnings],Таблица1[2019],B10)","v":0},0]
[null,"00:00 1,5 45 Max PS Friz  Turbo 9",null,null,{"$f":"IFERROR(IF(VLOOKUP($B11,Таблица1[],9,0)=0,\"\",VLOOKUP($B11,Таблица1[],9,0)),\"\")","v":""},{"$f":"IFERROR(VLOOKUP($B11,Таблица1[],16,0),\"\")","v":""},{"$f":"IFERROR(VLOOKUP($B11,Таблица1[],10,0),\"\")","v":""},{"$f":"IFERROR(VLOOKUP($B11,Таблица1[],11,0),\"\")","v":""},{"$f":"IFERROR(VLOOKUP($B11,Таблица1[],12,0),\"\")","v":""},{"$f":"IFERROR(VLOOKUP($B11,Таблица1[],13,0),\"\")","v":""},{"$f":"IFERROR(VLOOKUP($B11,Таблица1[],14,0),\"\")","v":""},{"$f":"COUNTIFS(Таблица1[2019],B11)+SUMIFS(Таблица1[Re-entry],Таблица1[2019],B11)","v":0},{"$f":"SUMIFS(Таблица1[Total Buy-In],Таблица1[2019],B11)","v":0},0,{"$f":"IFERROR(COUNTIFS(Таблица1[2019],B11,Таблица1[Winnings],\">0\")/L11*100,0)","v":0},{"$f":"SUMIFS(Таблица1[Total Hands],Таблица1[2019],B11)","v":0},{"$f":"IFERROR(SUMIFS(Таблица1[bb/101],Таблица1[2019],B11)/P11,0)","v":0},{"$f":"IFERROR(SUMIFS(Таблица1[EV bb/101],Таблица1[2019],B11)/P11,0)","v":0},{"$f":"SUMIFS(Таблица1[Net Winnings],Таблица1[2019],B11)","v":0},0]
[null,"00:00 1,5 6 Max PS Friz  Turbo 6",null,null,{"$f":"IFERROR(IF(VLOOKUP($B12,Таблица1[],9,0)=0,\"\",VLOOKUP($B12,Таблица1[],9,0)),\"\")","v":""},{"$f":"IFERROR(VLOOKUP($B12,Таблица1[],16,0),\"\")","v":""},{"$f":"IFERROR(VLOOKUP($B12,Таблица1[],10,0),\"\")","v":""},{"$f":"IFERROR(VLOOKUP($B12,Таблица1[],11,0),\"\")","v":""},{"$f":"IFERROR(VLOOKUP($B12,Таблица1[],12,0),\"\")","v":""},{"$f":"IFERROR(VLOOKUP($B12,Таблица1[],13,0),\"\")","v":""},{"$f":"IFERROR(VLOOKUP($B12,Таблица1[],14,0),\"\")","v":""},{"$f":"COUNTIFS(Таблица1[2019],B12)+SUMIFS(Таблица1[Re-entry],Таблица1[2019],B12)","v":0},{"$f":"SUMIFS(Таблица1[Total Buy-In],Таблица1[2019],B12)","v":0},0,{"$f":"IFERROR(COUNTIFS(Таблица1[2019],B12,Таблица1[Winnings],\">0\")/L12*100,0)","v":0},{"$f":"SUMIFS(Таблица1[Total Hands],Таблица1[2019],B12)","v":0},{"$f":"IFERROR(SUMIFS(Таблица1[bb/101],Таблица1[2019],B12)/P12,0)","v":0},{"$f":"IFERROR(SUMIFS(Таблица1[EV bb/101],Таблица1[2019],B12)/P12,0)","v":0},{"$f":"SUMIFS(Таблица1[Net Winnings],Таблица1[2019],B12)","v":0},0]
[null,"00:00 2,5 180 Max PS Friz  Turbo 9",null,null,{"$f":"IFERROR(IF(VLOOKUP($B13,Таблица1[],9,0)=0,\"\",VLOOKUP($B13,Таблица1[],9,0)),\"\")","v":""},{"$f":"IFERROR(VLOOKUP($B13,Таблица1[],16,0),\"\")","v":""},{"$f":"IFERROR(VLOOKUP($B13,Таблица1[],10,0),\"\")","v":""},{"$f":"IFERROR(VLOOKUP($B13,Таблица1[],11,0),\"\")","v":""},{"$f":"IFERROR(VLOOKUP($B13,Таблица1[],12,0),\"\")","v":""},{"$f":"IFERROR(VLOOKUP($B13,Таблица1[],13,0),\"\")","v":""},{"$f":"IFERROR(VLOOKUP($B13,Таблица1[],14,0),\"\")","v":""},{"$f":"COUNTIFS(Таблица1[2019],B13)+SUMIFS(Таблица1[Re-entry],Таблица1[2019],B13)","v":0},{"$f":"SUMIFS(Таблица1[Total Buy-In],Таблица1[2019],B13)","v":0},0,{"$f":"IFERROR(COUNTIFS(Таблица1[2019],B13,Таблица1[Winnings],\">0\")/L13*100,0)","v":0},{"$f":"SUMIFS(Таблица1[Total Hands],Таблица1[2019],B13)","v":0},{"$f":"IFERROR(SUMIFS(Таблица1[bb/101],Таблица1[2019],B13)/P13,0)","v":0},{"$f":"IFERROR(SUMIFS(Таблица1[EV bb/101],Таблица1[2019],B13)/P13,0)","v":0},{"$f":"SUMIFS(Таблица1[Net Winnings],Таблица1[2019],B13)","v":0},0]
[null,"00:20 1,1 Gtd PS Friz  Regular 9",null,null,{"$f":"IFERROR(IF(VLOOKUP($B14,Таблица1[],9,0)=0,\"\",VLOOKUP($B14,Таблица1[],9,0)),\"\")","v":""},{"$f":"IFERROR(VLOOKUP($B14,Таблица1[],16,0),\"\")","v":""},{"$f":"IFERROR(VLOOKUP($B14,Таблица1[],10,0),\"\")","v":""},{"$f":"IFERROR(VLOOKUP($B14,Таблица1[],11,0),\"\")","v":""},{"$f":"IFERROR(VLOOKUP($B14,Таблица1[],12,0),\"\")","v":""},{"$f":"IFERROR(VLOOKUP($B14,Таблица1[],13,0),\"\")","v":""},{"$f":"IFERROR(VLOOKUP($B14,Таблица1[],14,0),\"\")","v":""},{"$f":"COUNTIFS(Таблица1[2019],B14)+SUMIFS(Таблица1[Re-entry],Таблица1[2019],B14)","v":0},{"$f":"SUMIFS(Таблица1[Total Buy-In],Таблица1[2019],B14)","v":0},0,{"$f":"IFERROR(COUNTIFS(Таблица1[2019],B14,Таблица1[Winnings],\">0\")/L14*100,0)","v":0},{"$f":"SUMIFS(Таблица1[Total Hands],Таблица1[2019],B14)","v":0},{"$f":"IFERROR(SUMIFS(Таблица1[bb/101],Таблица1[2019],B14)/P14,0)","v":0},{"$f":"IFERROR(SUMIFS(Таблица1[EV bb/101],Таблица1[2019],B14)/P14,0)","v":0},{"$f":"SUMIFS(Таблица1[Net Winnings],Таблица1[2019],B14)","v":0},0]
[null,"05:00 4,4 Big PS Friz  Regular 9",null,null,{"$f":"IFERROR(IF(VLOOKUP($B15,Таблица1[],9,0)=0,\"\",VLOOKUP($B15,Таблица1[],9,0)),\"\")","v":""},{"$f":"IFERROR(VLOOKUP($B15,Таблица1[],16,0),\"\")","v":""},{"$f":"IFERROR(VLOOKUP($B15,Таблица1[],10,0),\"\")","v":""},{"$f":"IFERROR(VLOOKUP($B15,Таблица1[],11,0),\"\")","v":""},{"$f":"IFERROR(VLOOKUP($B15,Таблица1[],12,0),\"\")","v":""},{"$f":"IFERROR(VLOOKUP($B15,Таблица1[],13,0),\"\")","v":""},{"$f":"IFERROR(VLOOKUP($B15,Таблица1[],14,0),\"\")","v":""},{"$f":"COUNTIFS(Таблица1[2019],B15)+SUMIFS(Таблица1[Re-entry],Таблица1[2019],B15)","v":0},{"$f":"SUMIFS(Таблица1[Total Buy-In],Таблица1[2019],B15)","v":0},0,{"$f":"IFERROR(COUNTIFS(Таблица1[2019],B15,Таблица1[Winnings],\">0\")/L15*100,0)","v":0},{"$f":"SUMIFS(Таблица1[Total Hands],Таблица1[2019],B15)","v":0},{"$f":"IFERROR(SUMIFS(Таблица1[bb/101],Таблица1[2019],B15)/P15,0)","v":0},{"$f":"IFERROR(SUMIFS(Таблица1[EV bb/101],Таблица1[2019],B15)/P15,0)","v":0},{"$f":"SUMIFS(Таблица1[Net Winnings],Таблица1[2019],B15)","v":0},0]
[null,"05:10 2,2 Deep Stacks PS Friz  Regular 9",null,null,{"$f":"IFERROR(IF(VLOOKUP($B16,Таблица1[],9,0)=0,\"\",VLOOKUP($B16,Таблица1[],9,0)),\"\")","v":""},{"$f":"IFERROR(VLOOKUP($B16,Таблица1[],16,0),\"\")","v":""},{"$f":"IFERROR(VLOOKUP($B16,Таблица1[],10,0),\"\")","v":""},{"$f":"IFERROR(VLOOKUP($B16,Таблица1[],11,0),\"\")","v":""},{"$f":"IFERROR(VLOOKUP($B16,Таблица1[],12,0),\"\")","v":""},{"$f":"IFERROR(VLOOKUP($B16,Таблица1[],13,0),\"\")","v":""},{"$f":"IFERROR(VLOOKUP($B16,Таблица1[],14,0),\"\")","v":""},{"$f":"COUNTIFS(Таблица1[2019],B16)+SUMIFS(Таблица1[Re-entry],Таблица1[2019],B16)","v":0},{"$f":"SUMIFS(Таблица1[Total Buy-In],Таблица1[2019],B16)","v":0},0,{"$f":"IFERROR(COUNTIFS(Таблица1[2019],B16,Таблица1[Winnings],\">0\")/L16*100,0)","v":0},{"$f":"SUMIFS(Таблица1[Total Hands],Таблица1[2019],B16)","v":0},{"$f":"IFERROR(SUMIFS(Таблица1[bb/101],Таблица1[2019],B16)/P16,0)","v":0},{"$f":"IFERROR(SUMIFS(Таблица1[EV bb/101],Таблица1[2019],B16)/P16,0)","v":0},{"$f":"SUMIFS(Таблица1[Net Winnings],Таблица1[2019],B16)","v":0},0]
[null,"05:30 5 Gtd PAC Friz  Regular 8",null,null,{"$f":"IFERROR(IF(VLOOKUP($B17,Таблица1[],9,0)=0,\"\",VLOOKUP($B17,Таблица1[],9,0)),\"\")","v":""},{"$f":"IFERROR(VLOOKUP($B17,Таблица1[],16,0),\"\")","v":""},{"$f":"IFERROR(VLOOKUP($B17,Таблица1[],10,0),\"\")","v":""},{"$f":"IFERROR(VLOOKUP($B17,Таблица1[],11,0),\"\")","v":""},{"$f":"IFERROR(VLOOKUP($B17,Таблица1[],12,0),\"\")","v":""},{"$f":"IFERROR(VLOOKUP($B17,Таблица1[],13,0),\"\")","v":""},{"$f":"IFERROR(VLOOKUP($B17,Таблица1[],14,0),\"\")","v":""},{"$f":"COUNTIFS(Таблица1[2019],B17)+SUMIFS(Таблица1[Re-entry],Таблица1[2019],B17)","v":0},{"$f":"SUMIFS(Таблица1[Total Buy-In],Таблица1[2019],B17)","v":0},0,{"$f":"IFERROR(COUNTIFS(Таблица1[2019],B17,Таблица1[Winnings],\">0\")/L17*100,0)","v":0},{"$f":"SUMIFS(Таблица1[Total Hands],Таблица1[2019],B17)","v":0},{"$f":"IFERROR(SUMIFS(Таблица1[bb/101],Таблица1[2019],B17)/P17,0)","v":0},{"$f":"IFERROR(SUMIFS(Таблица1[EV bb/101],Таблица1[2019],B17)/P17,0)","v":0},{"$f":"SUMIFS(Таблица1[Net Winnings],Таблица1[2019],B17)","v":0},0]
[null,"06:05 4,4 Progressive KO PS KO  Regular 9",null,null,{"$f":"IFERROR(IF(VLOOKUP($B18,Таблица1[],9,0)=0,\"\",VLOOKUP($B18,Таблица1[],9,0)),\"\")","v":""},{"$f":"IFERROR(VLOOKUP($B18,Таблица1[],16,0),\"\")","v":""},{"$f":"IFERROR(VLOOKUP($B18,Таблица1[],10,0),\"\")","v":""},{"$f":"IFERROR(VLOOKUP($B18,Таблица1[],11,0),\"\")","v":""},{"$f":"IFERROR(VLOOKUP($B18,Таблица1[],12,0),\"\")","v":""},{"$f":"IFERROR(VLOOKUP($B18,Таблица1[],13,0),\"\")","v":""},{"$f":"IFERROR(VLOOKUP($B18,Таблица1[],14,0),\"\")","v":""},{"$f":"COUNTIFS(Таблица1[2019],B18)+SUMIFS(Таблица1[Re-entry],Таблица1[2019],B18)","v":0},{"$f":"SUMIFS(Таблица1[Total Buy-In],Таблица1[2019],B18)","v":0},0,{"$f":"IFERROR(COUNTIFS(Таблица1[2019],B18,Таблица1[Winnings],\">0\")/L18*100,0)","v":0},{"$f":"SUMIFS(Таблица1[Total Hands],Таблица1[2019],B18)","v":0},{"$f":"IFERROR(SUMIFS(Таблица1[bb/101],Таблица1[2019],B18)/P18,0)","v":0},{"$f":"IFERROR(SUMIFS(Таблица1[EV bb/101],Таблица1[2019],B18)/P18,0)","v":0},{"$f":"SUMIFS(Таблица1[Net Winnings],Таблица1[2019],B18)","v":0},0]
[null,"06:15 1,1 Hot PS Friz  Turbo 9",null,null,{"$f":"IFERROR(IF(VLOOKUP($B19,Таблица1[],9,0)=0,\"\",VLOOKUP($B19,Таблица1[],9,0)),\"\")","v":""},{"$f":"IFERROR(VLOOKUP($B19,Таблица1[],16,0),\"\")","v":""},{"$f":"IFERROR(VLOOKUP($B19,Таблица1[],10,0),\"\")","v":""},{"$f":"IFERROR(VLOOKUP($B19,Таблица1[],11,0),\"\")","v":""},{"$f":"IFERROR(VLOOKUP($B19,Таблица1[],12,0),\"\")","v":""},{"$f":"IFERROR(VLOOKUP($B19,Таблица1[],13,0),\"\")","v":""},{"$f":"IFERROR(VLOOKUP($B19,Таблица1[],14,0),\"\")","v":""},{"$f":"COUNTIFS(Таблица1[2019],B19)+SUMIFS(Таблица1[Re-entry],Таблица1[2019],B19)","v":0},{"$f":"SUMIFS(Таблица1[Total Buy-In],Таблица1[2019],B19)","v":0},0,{"$f":"IFERROR(COUNTIFS(Таблица1[2019],B19,Таблица1[Winnings],\">0\")/L19*100,0)","v":0},{"$f":"SUMIFS(Таблица1[Total Hands],Таблица1[2019],B19)","v":0},{"$f":"IFERROR(SUMIFS(Таблица1[bb/101],Таблица1[2019],B19)/P19,0)","v":0},{"$f":"IFERROR(SUMIFS(Таблица1[EV bb/101],Таблица1[2019],B19)/P19,0)","v":0},{"$f":"SUMIFS(Таблица1[Net Winnings],Таблица1[2019],B19)","v":0},0]
[null,"07:00 2,2 Big PS Friz  Regular 9",null,null,{"$f":"IFERROR(IF(VLOOKUP($B20,Таблица1[],9,0)=0,\"\",VLOOKUP($B20,Таблица1[],9,0)),\"\")","v":""},{"$f":"IFERROR(VLOOKUP($B20,Таблица1[],16,0),\"\")","v":""},{"$f":"IFERROR(VLOOKUP($B20,Таблица1[],10,0),\"\")","v":""},{"$f":"IFERROR(VLOOKUP($B20,Таблица1[],11,0),\"\")","v":""},{"$f":"IFERROR(VLOOKUP($B20,Таблица1[],12,0),\"\")","v":""},{"$f":"IFERROR(VLOOKUP($B20,Таблица1[],13,0),\"\")","v":""},{"$f":"IFERROR(VLOOKUP($B20,Таблица1[],14,0),\"\")","v":""},{"$f":"COUNTIFS(Таблица1[2019],B20)+SUMIFS(Таблица1[Re-entry],Таблица1[2019],B20)","v":0},{"$f":"SUMIFS(Таблица1[Total Buy-In],Таблица1[2019],B20)","v":0},0,{"$f":"IFERROR(COUNTIFS(Таблица1[2019],B20,Таблица1[Winnings],\">0\")/L20*100,0)","v":0},{"$f":"SUMIFS(Таблица1[Total Hands],Таблица1[2019],B20)","v":0},{"$f":"IFERROR(SUMIFS(Таблица1[bb/101],Таблица1[2019],B20)/P20,0)","v":0},{"$f":"IFERROR(SUMIFS(Таблица1[EV bb/101],Таблица1[2019],B20)/P20,0)","v":0},{"$f":"SUMIFS(Таблица1[Net Winnings],Таблица1[2019],B20)","v":0},0]
[null,"07:00 3 Gtd ES Friz  Regular 9",null,null,{"$f":"IFERROR(IF(VLOOKUP($B21,Таблица1[],9,0)=0,\"\",VLOOKUP($B21,Таблица1[],9,0)),\"\")","v":""},{"$f":"IFERROR(VLOOKUP($B21,Таблица1[],16,0),\"\")","v":""},{"$f":"IFERROR(VLOOKUP($B21,Таблица1[],10,0),\"\")","v":""},{"$f":"IFERROR(VLOOKUP($B21,Таблица1[],11,0),\"\")","v":""},{"$f":"IFERROR(VLOOKUP($B21,Таблица1[],12,0),\"\")","v":""},{"$f":"IFERROR(VLOOKUP($B21,Таблица1[],13,0),\"\")","v":""},{"$f":"IFERROR(VLOOKUP($B21,Таблица1[],14,0),\"\")","v":""},{"$f":"COUNTIFS(Таблица1[2019],B21)+SUMIFS(Таблица1[Re-entry],Таблица1[2019],B21)","v":0},{"$f":"SUMIFS(Таблица1[Total Buy-In],Таблица1[2019],B21)","v":0},0,{"$f":"IFERROR(COUNTIFS(Таблица1[2019],B21,Таблица1[Winnings],\">0\")/L21*100,0)","v":0},{"$f":"SUMIFS(Таблица1[Total Hands],Таблица1[2019],B21)","v":0},{"$f":"IFERROR(SUMIFS(Таблица1[bb/101],Таблица1[2019],B21)/P21,0)","v":0},{"$f":"IFERROR(SUMIFS(Таблица1[EV bb/101],Таблица1[2019],B21)/P21,0)","v":0},{"$f":"SUMIFS(Таблица1[Net Winnings],Таблица1[2019],B21)","v":0},0]
[null,"07:00 3,3 Progressive KO PS KO  Turbo 9",null,null,{"$f":"IFERROR(IF(VLOOKUP($B22,Таблица1[],9,0)=0,\"\",VLOOKUP($B22,Таблица1[],9,0)),\"\")","v":""},{"$f":"IFERROR(VLOOKUP($B22,Таблица1[],16,0),\"\")","v":""},{"$f":"IFERROR(VLOOKUP($B22,Таблица1[],10,0),\"\")","v":""},{"$f":"IFERROR(VLOOKUP($B22,Таблица1[],11,0),\"\")","v":""},{"$f":"IFERROR(VLOOKUP($B22,Таблица1[],12,0),\"\")","v":""},{"$f":"IFERROR(VLOOKUP($B22,Таблица1[],13,0),\"\")","v":""},{"$f":"IFERROR(VLOOKUP($B22,Таблица1[],14,0),\"\")","v":""},{"$f":"COUNTIFS(Таблица1[2019],B22)+SUMIFS(Таблица1[Re-entry],Таблица1[2019],B22)","v":0},{"$f":"SUMIFS(Таблица1[Total Buy-In],Таблица1[2019],B22)","v":0},0,{"$f":"IFERROR(COUNTIFS(Таблица1[2019],B22,Таблица1[Winnings],\">0\")/L22*100,0)","v":0},{"$f":"SUMIFS(Таблица1[Total Hands],Таблица1[2019],B22)","v":0},{"$f":"IFERROR(SUMIFS(Таблица1[bb/101],Таблица1[2019],B22)/P22,0)","v":0},{"$f":"IFERROR(SUMIFS(Таблица1[EV bb/101],Таблица1[2019],B22)/P22,0)","v":0},{"$f":"SUMIFS(Таблица1[Net Winnings],Таблица1[2019],B22)","v":0},0]
[null,"07:15 11 Progressive KO PS KO  Regular 9",null,null,{"$f":"IFERROR(IF(VLOOKUP($B23,Таблица1[],9,0)=0,\"\",VLOOKUP($B23,Таблица1[],9,0)),\"\")","v":""},{"$f":"IFERROR(VLOOKUP($B23,Таблица1[],16,0),\"\")","v":""},{"$f":"IFERROR(VLOOKUP($B23,Таблица1[],10,0),\"\")","v":""},{"$f":"IFERROR(VLOOKUP($B23,Таблица1[],11,0),\"\")","v":""},{"$f":"IFERROR(VLOOKUP($B23,Таблица1[],12,0),\"\")","v":""},{"$f":"IFERROR(VLOOKUP($B23,Таблица1[],13,0),\"\")","v":""},{"$f":"IFERROR(VLOOKUP($B23,Таблица1[],14,0),\"\")","v":""},{"$f":"COUNTIFS(Таблица1[2019],B23)+SUMIFS(Таблица1[Re-entry],Таблица1[2019],B23)","v":0},{"$f":"SUMIFS(Таблица1[Total Buy-In],Таблица1[2019],B23)","v":0},0,{"$f":"IFERROR(COUNTIFS(Таблица1[2019],B23,Таблица1[Winnings],\">0\")/L23*100,0)","v":0},{"$f":"SUMIFS(Таблица1[Total Hands],Таблица1[2019],B23)","v":0},{"$f":"IFERROR(SUMIFS(Таблица1[bb/101],Таблица1[2019],B23)/P23,0)","v":0},{"$f":"IFERROR(SUMIFS(Таблица1[EV bb/101],Таблица1[2019],B23)/P23,0)","v":0},{"$f":"SUMIFS(Таблица1[Net Winnings],Таблица1[2019],B23)","v":0},0]
[null,"07:15 5 Gtd PAC Friz  Regular 9",null,null,{"$f":"IFERROR(IF(VLOOKUP($B24,Таблица1[],9,0)=0,\"\",VLOOKUP($B24,Таблица1[],9,0)),\"\")","v":""},{"$f":"IFERROR(VLOOKUP($B24,Таблица1[],16,0),\"\")","v":""},{"$f":"IFERROR(VLOOKUP($B24,Таблица1[],10,0),\"\")","v":""},{"$f":"IFERROR(VLOOKUP($B24,Таблица1[],11,0),\"\")","v":""},{"$f":"IFERROR(VLOOKUP($B24,Таблица1[],12,0),\"\")","v":""},{"$f":"IFERROR(VLOOKUP($B24,Таблица1[],13,0),\"\")","v":""},{"$f":"IFERROR(VLOOKUP($B24,Таблица1[],14,0),\"\")","v":""},{"$f":"COUNTIFS(Таблица1[2019],B24)+SUMIFS(Таблица1[Re-entry],Таблица1[2019],B24)","v":0},{"$f":"SUMIFS(Таблица1[Total Buy-In],Таблица1[2019],B24)","v":0},0,{"$f":"IFERROR(COUNTIFS(Таблица1[2019],B24,Таблица1[Winnings],\">0\")/L24*100,0)","v":0},{"$f":"SUMIFS(Таблица1[Total Hands],Таблица1[2019],B24)","v":0},{"$f":"IFERROR(SUMIFS(Таблица1[bb/101],Таблица1[2019],B24)/P24,0)","v":0},{"$f":"IFERROR(SUMIFS(Таблица1[EV bb/101],Таблица1[2019],B24)/P24,0)","v":0},{"$f":"SUMIFS(Таблица1[Net Winnings],Таблица1[2019],B24)","v":0},0]
[null,"07:30 5,5 Bounty Builder PS KO  Regular 9",null,null,{"$f":"IFERROR(IF(VLOOKUP($B25,Таблица1[],9,0)=0,\"\",VLOOKUP($B25,Таблица1[],9,0)),\"\")","v":""},{"$f":"IFERROR(VLOOKUP($B25,Таблица1[],16,0),\"\")","v":""},{"$f":"IFERROR(VLOOKUP($B25,Таблица1[],10,0),\"\")","v":""},{"$f":"IFERROR(VLOOKUP($B25,Таблица1[],11,0),\"\")","v":""},{"$f":"IFERROR(VLOOKUP($B25,Таблица1[],12,0),\"\")","v":""},{"$f":"IFERROR(VLOOKUP($B25,Таблица1[],13,0),\"\")","v":""},{"$f":"IFERROR(VLOOKUP($B25,Таблица1[],14,0),\"\")","v":""},{"$f":"COUNTIFS(Таблица1[2019],B25)+SUMIFS(Таблица1[Re-entry],Таблица1[2019],B25)","v":0},{"$f":"SUMIFS(Таблица1[Total Buy-In],Таблица1[2019],B25)","v":0},0,{"$f":"IFERROR(COUNTIFS(Таблица1[2019],B25,Таблица1[Winnings],\">0\")/L25*100,0)","v":0},{"$f":"SUMIFS(Таблица1[Total Hands],Таблица1[2019],B25)","v":0},{"$f":"IFERROR(SUMIFS(Таблица1[bb/101],Таблица1[2019],B25)/P25,0)","v":0},{"$f":"IFERROR(SUMIFS(Таблица1[EV bb/101],Таблица1[2019],B25)/P25,0)","v":0},{"$f":"SUMIFS(Таблица1[Net Winnings],Таблица1[2019],B25)","v":0},0]
[null,"07:45 3,3 Gtd PAC Friz  Regular 9",null,null,{"$f":"IFERROR(IF(VLOOKUP($B26,Таблица1[],9,0)=0,\"\",VLOOKUP($B26,Таблица1[],9,0)),\"\")","v":""},{"$f":"IFERROR(VLOOKUP($B26,Таблица1[],16,0),\"\")","v":""},{"$f":"IFERROR(VLOOKUP($B26,Таблица1[],10,0),\"\")","v":""},{"$f":"IFERROR(VLOOKUP($B26,Таблица1[],11,0),\"\")","v":""},{"$f":"IFERROR(VLOOKUP($B26,Таблица1[],12,0),\"\")","v":""},{"$f":"IFERROR(VLOOKUP($B26,Таблица1[],13,0),\"\")","v":""},{"$f":"IFERROR(VLOOKUP($B26,Таблица1[],14,0),\"\")","v":""},{"$f":"COUNTIFS(Таблица1[2019],B26)+SUMIFS(Таблица1[Re-entry],Таблица1[2019],B26)","v":0},{"$f":"SUMIFS(Таблица1[Total Buy-In],Таблица1[2019],B26)","v":0},0,{"$f":"IFERROR(COUNTIFS(Таблица1[2019],B26,Таблица1[Winnings],\">0\")/L26*100,0)","v":0},{"$f":"SUMIFS(Таблица1[Total Hands],Таблица1[2019],B26)","v":0},{"$f":"IFERROR(SUMIFS(Таблица1[bb/101],Таблица1[2019],B26)/P26,0)","v":0},{"$f":"IFERROR(SUMIFS(Таблица1[EV bb/101],Таблица1[2019],B26)/P26,0)","v":0},{"$f":"SUMIFS(Таблица1[Net Winnings],Таблица1[2019],B26)","v":0},0]
[null,"08:00 3,3 Progressive KO PS KO  Turbo 9",null,null,{"$f":"IFERROR(IF(VLOOKUP($B27,Таблица1[],9,0)=0,\"\",VLOOKUP($B27,Таблица1[],9,0)),\"\")","v":""},{"$f":"IFERROR(VLOOKUP($B27,Таблица1[],16,0),\"\")","v":""},{"$f":"IFERROR(VLOOKUP($B27,Таблица1[],10,0),\"\")","v":""},{"$f":"IFERROR(VLOOKUP($B27,Таблица1[],11,0),\"\")","v":""},{"$f":"IFERROR(VLOOKUP($B27,Таблица1[],12,0),\"\")","v":""},{"$f":"IFERROR(VLOOKUP($B27,Таблица1[],13,0),\"\")","v":""},{"$f":"IFERROR(VLOOKUP($B27,Таблица1[],14,0),\"\")","v":""},{"$f":"COUNTIFS(Таблица1[2019],B27)+SUMIFS(Таблица1[Re-entry],Таблица1[2019],B27)","v":0},{"$f":"SUMIFS(Таблица1[Total Buy-In],Таблица1[2019],B27)","v":0},0,{"$f":"IFERROR(COUNTIFS(Таблица1[2019],B27,Таблица1[Winnings],\">0\")/L27*100,0)","v":0},{"$f":"SUMIFS(Таблица1[Total Hands],Таблица1[2019],B27)","v":0},{"$f":"IFERROR(SUMIFS(Таблица1[bb/101],Таблица1[2019],B27)/P27,0)","v":0},{"$f":"IFERROR(SUMIFS(Таблица1[EV bb/101],Таблица1[2019],B27)/P27,0)","v":0},{"$f":"SUMIFS(Таблица1[Net Winnings],Таблица1[2019],B27)","v":0},0]
[null,"08:05 2 Gtd ES Friz  Regular 9",null,null,{"$f":"IFERROR(IF(VLOOKUP($B28,Таблица1[],9,0)=0,\"\",VLOOKUP($B28,Таблица1[],9,0)),\"\")","v":""},{"$f":"IFERROR(VLOOKUP($B28,Таблица1[],16,0),\"\")","v":""},{"$f":"IFERROR(VLOOKUP($B28,Таблица1[],10,0),\"\")","v":""},{"$f":"IFERROR(VLOOKUP($B28,Таблица1[],11,0),\"\")","v":""},{"$f":"IFERROR(VLOOKUP($B28,Таблица1[],12,0),\"\")","v":""},{"$f":"IFERROR(VLOOKUP($B28,Таблица1[],13,0),\"\")","v":""},{"$f":"IFERROR(VLOOKUP($B28,Таблица1[],14,0),\"\")","v":""},{"$f":"COUNTIFS(Таблица1[2019],B28)+SUMIFS(Таблица1[Re-entry],Таблица1[2019],B28)","v":0},{"$f":"SUMIFS(Таблица1[Total Buy-In],Таблица1[2019],B28)","v":0},0,{"$f":"IFERROR(COUNTIFS(Таблица1[2019],B28,Таблица1[Winnings],\">0\")/L28*100,0)","v":0},{"$f":"SUMIFS(Таблица1[Total Hands],Таблица1[2019],B28)","v":0},{"$f":"IFERROR(SUMIFS(Таблица1[bb/101],Таблица1[2019],B28)/P28,0)","v":0},{"$f":"IFERROR(SUMIFS(Таблица1[EV bb/101],Таблица1[2019],B28)/P28,0)","v":0},{"$f":"SUMIFS(Таблица1[Net Winnings],Таблица1[2019],B28)","v":0},0]
[null,"08:10 5,5 Deep Stacks PS Friz  Regular 9",null,null,{"$f":"IFERROR(IF(VLOOKUP($B29,Таблица1[],9,0)=0,\"\",VLOOKUP($B29,Таблица1[],9,0)),\"\")","v":""},{"$f":"IFERROR(VLOOKUP($B29,Таблица1[],16,0),\"\")","v":""},{"$f":"IFERROR(VLOOKUP($B29,Таблица1[],10,0),\"\")","v":""},{"$f":"IFERROR(VLOOKUP($B29,Таблица1[],11,0),\"\")","v":""},{"$f":"IFERROR(VLOOKUP($B29,Таблица1[],12,0),\"\")","v":""},{"$f":"IFERROR(VLOOKUP($B29,Таблица1[],13,0),\"\")","v":""},{"$f":"IFERROR(VLOOKUP($B29,Таблица1[],14,0),\"\")","v":""},{"$f":"COUNTIFS(Таблица1[2019],B29)+SUMIFS(Таблица1[Re-entry],Таблица1[2019],B29)","v":0},{"$f":"SUMIFS(Таблица1[Total Buy-In],Таблица1[2019],B29)","v":0},0,{"$f":"IFERROR(COUNTIFS(Таблица1[2019],B29,Таблица1[Winnings],\">0\")/L29*100,0)","v":0},{"$f":"SUMIFS(Таблица1[Total Hands],Таблица1[2019],B29)","v":0},{"$f":"IFERROR(SUMIFS(Таблица1[bb/101],Таблица1[2019],B29)/P29,0)","v":0},{"$f":"IFERROR(SUMIFS(Таблица1[EV bb/101],Таблица1[2019],B29)/P29,0)","v":0},{"$f":"SUMIFS(Таблица1[Net Winnings],Таблица1[2019],B29)","v":0},0]
[null,"08:30 2,2 Gtd PS Friz  Regular 9",null,null,{"$f":"IFERROR(IF(VLOOKUP($B30,Таблица1[],9,0)=0,\"\",VLOOKUP($B30,Таблица1[],9,0)),\"\")","v":""},{"$f":"IFERROR(VLOOKUP($B30,Таблица1[],16,0),\"\")","v":""},{"$f":"IFERROR(VLOOKUP($B30,Таблица1[],10,0),\"\")","v":""},{"$f":"IFERROR(VLOOKUP($B30,Таблица1[],11,0),\"\")","v":""},{"$f":"IFERROR(VLOOKUP($B30,Таблица1[],12,0),\"\")","v":""},{"$f":"IFERROR(VLOOKUP($B30,Таблица1[],13,0),\"\")","v":""},{"$f":"IFERROR(VLOOKUP($B30,Таблица1[],14,0),\"\")","v":""},{"$f":"COUNTIFS(Таблица1[2019],B30)+SUMIFS(Таблица1[Re-entry],Таблица1[2019],B30)","v":0},{"$f":"SUMIFS(Таблица1[Total Buy-In],Таблица1[2019],B30)","v":0},0,{"$f":"IFERROR(COUNTIFS(Таблица1[2019],B30,Таблица1[Winnings],\">0\")/L30*100,0)","v":0},{"$f":"SUMIFS(Таблица1[Total Hands],Таблица1[2019],B30)","v":0},{"$f":"IFERROR(SUMIFS(Таблица1[bb/101],Таблица1[2019],B30)/P30,0)","v":0},{"$f":"IFERROR(SUMIFS(Таблица1[EV bb/101],Таблица1[2019],B30)/P30,0)","v":0},{"$f":"SUMIFS(Таблица1[Net Winnings],Таблица1[2019],B30)","v":0},0]
[null,"09:00 1,1 Progressive KO PS KO  Turbo 9",null,null,{"$f":"IFERROR(IF(VLOOKUP($B31,Таблица1[],9,0)=0,\"\",VLOOKUP($B31,Таблица1[],9,0)),\"\")","v":""},{"$f":"IFERROR(VLOOKUP($B31,Таблица1[],16,0),\"\")","v":""},{"$f":"IFERROR(VLOOKUP($B31,Таблица1[],10,0),\"\")","v":""},{"$f":"IFERROR(VLOOKUP($B31,Таблица1[],11,0),\"\")","v":""},{"$f":"IFERROR(VLOOKUP($B31,Таблица1[],12,0),\"\")","v":""},{"$f":"IFERROR(VLOOKUP($B31,Таблица1[],13,0),\"\")","v":""},{"$f":"IFERROR(VLOOKUP($B31,Таблица1[],14,0),\"\")","v":""},{"$f":"COUNTIFS(Таблица1[2019],B31)+SUMIFS(Таблица1[Re-entry],Таблица1[2019],B31)","v":0},{"$f":"SUMIFS(Таблица1[Total Buy-In],Таблица1[2019],B31)","v":0},0,{"$f":"IFERROR(COUNTIFS(Таблица1[2019],B31,Таблица1[Winnings],\">0\")/L31*100,0)","v":0},{"$f":"SUMIFS(Таблица1[Total Hands],Таблица1[2019],B31)","v":0},{"$f":"IFERROR(SUMIFS(Таблица1[bb/101],Таблица1[2019],B31)/P31,0)","v":0},{"$f":"IFERROR(SUMIFS(Таблица1[EV bb/101],Таблица1[2019],B31)/P31,0)","v":0},{"$f":"SUMIFS(Таблица1[Net Winnings],Таблица1[2019],B31)","v":0},0]
[null,"09:15 1,5 Gtd R/A PAC Friz  Regular 6",null,null,{"$f":"IFERROR(IF(VLOOKUP($B32,Таблица1[],9,0)=0,\"\",VLOOKUP($B32,Таблица1[],9,0)),\"\")","v":""},{"$f":"IFERROR(VLOOKUP($B32,Таблица1[],16,0),\"\")","v":""},{"$f":"IFERROR(VLOOKUP($B32,Таблица1[],10,0),\"\")","v":""},{"$f":"IFERROR(VLOOKUP($B32,Таблица1[],11,0),\"\")","v":""},{"$f":"IFERROR(VLOOKUP($B32,Таблица1[],12,0),\"\")","v":""},{"$f":"IFERROR(VLOOKUP($B32,Таблица1[],13,0),\"\")","v":""},{"$f":"IFERROR(VLOOKUP($B32,Таблица1[],14,0),\"\")","v":""},{"$f":"COUNTIFS(Таблица1[2019],B32)+SUMIFS(Таблица1[Re-entry],Таблица1[2019],B32)","v":0},{"$f":"SUMIFS(Таблица1[Total Buy-In],Таблица1[2019],B32)","v":0},0,{"$f":"IFERROR(COUNTIFS(Таблица1[2019],B32,Таблица1[Winnings],\">0\")/L32*100,0)","v":0},{"$f":"SUMIFS(Таблица1[Total Hands],Таблица1[2019],B32)","v":0},{"$f":"IFERROR(SUMIFS(Таблица1[bb/101],Таблица1[2019],B32)/P32,0)","v":0},{"$f":"IFERROR(SUMIFS(Таблица1[EV bb/101],Таблица1[2019],B32)/P32,0)","v":0},{"$f":"SUMIFS(Таблица1[Net Winnings],Таблица1[2019],B32)","v":0},0]
[null,"09:20 7,5 Progressive KO PS KO  Regular 9",null,null,{"$f":"IFERROR(IF(VLOOKUP($B33,Таблица1[],9,0)=0,\"\",VLOOKUP($B33,Таблица1[],9,0)),\"\")","v":""},{"$f":"IFERROR(VLOOKUP($B33,Таблица1[],16,0),\"\")","v":""},{"$f":"IFERROR(VLOOKUP($B33,Таблица1[],10,0),\"\")","v":""},{"$f":"IFERROR(VLOOKUP($B33,Таблица1[],11,0),\"\")","v":""},{"$f":"IFERROR(VLOOKUP($B33,Таблица1[],12,0),\"\")","v":""},{"$f":"IFERROR(VLOOKUP($B33,Таблица1[],13,0),\"\")","v":""},{"$f":"IFERROR(VLOOKUP($B33,Таблица1[],14,0),\"\")","v":""},{"$f":"COUNTIFS(Таблица1[2019],B33)+SUMIFS(Таблица1[Re-entry],Таблица1[2019],B33)","v":0},{"$f":"SUMIFS(Таблица1[Total Buy-In],Таблица1[2019],B33)","v":0},0,{"$f":"IFERROR(COUNTIFS(Таблица1[2019],B33,Таблица1[Winnings],\">0\")/L33*100,0)","v":0},{"$f":"SUMIFS(Таблица1[Total Hands],Таблица1[2019],B33)","v":0},{"$f":"IFERROR(SUMIFS(Таблица1[bb/101],Таблица1[2019],B33)/P33,0)","v":0},{"$f":"IFERROR(SUMIFS(Таблица1[EV bb/101],Таблица1[2019],B33)/P33,0)","v":0},{"$f":"SUMIFS(Таблица1[Net Winnings],Таблица1[2019],B33)","v":0},0]
[null,"09:30 1 Gtd ES Friz  Regular 9",null,null,{"$f":"IFERROR(IF(VLOOKUP($B34,Таблица1[],9,0)=0,\"\",VLOOKUP($B34,Таблица1[],9,0)),\"\")","v":""},{"$f":"IFERROR(VLOOKUP($B34,Таблица1[],16,0),\"\")","v":""},{"$f":"IFERROR(VLOOKUP($B34,Таблица1[],10,0),\"\")","v":""},{"$f":"IFERROR(VLOOKUP($B34,Таблица1[],11,0),\"\")","v":""},{"$f":"IFERROR(VLOOKUP($B34,Таблица1[],12,0),\"\")","v":""},{"$f":"IFERROR(VLOOKUP($B34,Таблица1[],13,0),\"\")","v":""},{"$f":"IFERROR(VLOOKUP($B34,Таблица1[],14,0),\"\")","v":""},{"$f":"COUNTIFS(Таблица1[2019],B34)+SUMIFS(Таблица1[Re-entry],Таблица1[2019],B34)","v":0},{"$f":"SUMIFS(Таблица1[Total Buy-In],Таблица1[2019],B34)","v":0},0,{"$f":"IFERROR(COUNTIFS(Таблица1[2019],B34,Таблица1[Winnings],\">0\")/L34*100,0)","v":0},{"$f":"SUMIFS(Таблица1[Total Hands],Таблица1[2019],B34)","v":0},{"$f":"IFERROR(SUMIFS(Таблица1[bb/101],Таблица1[2019],B34)/P34,0)","v":0},{"$f":"IFERROR(SUMIFS(Таблица1[EV bb/101],Таблица1[2019],B34)/P34,0)","v":0},{"$f":"SUMIFS(Таблица1[Net Winnings],Таблица1[2019],B34)","v":0},0]
[null,"09:30 12 Catfish PAC Friz  Regular 9",null,null,{"$f":"IFERROR(IF(VLOOKUP($B35,Таблица1[],9,0)=0,\"\",VLOOKUP($B35,Таблица1[],9,0)),\"\")","v":""},{"$f":"IFERROR(VLOOKUP($B35,Таблица1[],16,0),\"\")","v":""},{"$f":"IFERROR(VLOOKUP($B35,Таблица1[],10,0),\"\")","v":""},{"$f":"IFERROR(VLOOKUP($B35,Таблица1[],11,0),\"\")","v":""},{"$f":"IFERROR(VLOOKUP($B35,Таблица1[],12,0),\"\")","v":""},{"$f":"IFERROR(VLOOKUP($B35,Таблица1[],13,0),\"\")","v":""},{"$f":"IFERROR(VLOOKUP($B35,Таблица1[],14,0),\"\")","v":""},{"$f":"COUNTIFS(Таблица1[2019],B35)+SUMIFS(Таблица1[Re-entry],Таблица1[2019],B35)","v":0},{"$f":"SUMIFS(Таблица1[Total Buy-In],Таблица1[2019],B35)","v":0},0,{"$f":"IFERROR(COUNTIFS(Таблица1[2019],B35,Таблица1[Winnings],\">0\")/L35*100,0)","v":0},{"$f":"SUMIFS(Таблица1[Total Hands],Таблица1[2019],B35)","v":0},{"$f":"IFERROR(SUMIFS(Таблица1[bb/101],Таблица1[2019],B35)/P35,0)","v":0},{"$f":"IFERROR(SUMIFS(Таблица1[EV bb/101],Таблица1[2019],B35)/P35,0)","v":0},{"$f":"SUMIFS(Таблица1[Net Winnings],Таблица1[2019],B35)","v":0},0]
[null,"09:30 3,3 Bounty Builder PS KO  Regular 9",null,null,{"$f":"IFERROR(IF(VLOOKUP($B36,Таблица1[],9,0)=0,\"\",VLOOKUP($B36,Таблица1[],9,0)),\"\")","v":""},{"$f":"IFERROR(VLOOKUP($B36,Таблица1[],16,0),\"\")","v":""},{"$f":"IFERROR(VLOOKUP($B36,Таблица1[],10,0),\"\")","v":""},{"$f":"IFERROR(VLOOKUP($B36,Таблица1[],11,0),\"\")","v":""},{"$f":"IFERROR(VLOOKUP($B36,Таблица1[],12,0),\"\")","v":""},{"$f":"IFERROR(VLOOKUP($B36,Таблица1[],13,0),\"\")","v":""},{"$f":"IFERROR(VLOOKUP($B36,Таблица1[],14,0),\"\")","v":""},{"$f":"COUNTIFS(Таблица1[2019],B36)+SUMIFS(Таблица1[Re-entry],Таблица1[2019],B36)","v":0},{"$f":"SUMIFS(Таблица1[Total Buy-In],Таблица1[2019],B36)","v":0},{"$f":"IFERROR((S36/M36)*100,0)","v":0},{"$f":"IFERROR(COUNTIFS(Таблица1[2019],B36,Таблица1[Winnings],\">0\")/L36*100,0)","v":0},{"$f":"SUMIFS(Таблица1[Total Hands],Таблица1[2019],B36)","v":0},{"$f":"IFERROR(SUMIFS(Таблица1[bb/101],Таблица1[2019],B36)/P36,0)","v":0},{"$f":"IFERROR(SUMIFS(Таблица1[EV bb/101],Таблица1[2019],B36)/P36,0)","v":0},{"$f":"SUMIFS(Таблица1[Net Winnings],Таблица1[2019],B36)","v":0},{"$f":"IFERROR(S36/L36,0)","v":0}]
[null,"09:40 1 Gtd ES Friz  Turbo 9",null,null,{"$f":"IFERROR(IF(VLOOKUP($B37,Таблица1[],9,0)=0,\"\",VLOOKUP($B37,Таблица1[],9,0)),\"\")","v":""},{"$f":"IFERROR(VLOOKUP($B37,Таблица1[],16,0),\"\")","v":""},{"$f":"IFERROR(VLOOKUP($B37,Таблица1[],10,0),\"\")","v":""},{"$f":"IFERROR(VLOOKUP($B37,Таблица1[],11,0),\"\")","v":""},{"$f":"IFERROR(VLOOKUP($B37,Таблица1[],12,0),\"\")","v":""},{"$f":"IFERROR(VLOOKUP($B37,Таблица1[],13,0),\"\")","v":""},{"$f":"IFERROR(VLOOKUP($B37,Таблица1[],14,0),\"\")","v":""},{"$f":"COUNTIFS(Таблица1[2019],B37)+SUMIFS(Таблица1[Re-entry],Таблица1[2019],B37)","v":0},{"$f":"SUMIFS(Таблица1[Total Buy-In],Таблица1[2019],B37)","v":0},0,{"$f":"IFERROR(COUNTIFS(Таблица1[2019],B37,Таблица1[Winnings],\">0\")/L37*100,0)","v":0},{"$f":"SUMIFS(Таблица1[Total Hands],Таблица1[2019],B37)","v":0},{"$f":"IFERROR(SUMIFS(Таблица1[bb/101],Таблица1[2019],B37)/P37,0)","v":0},{"$f":"IFERROR(SUMIFS(Таблица1[EV bb/101],Таблица1[2019],B37)/P37,0)","v":0},{"$f":"SUMIFS(Таблица1[Net Winnings],Таблица1[2019],B37)","v":0},0]
[null,"09:45 1,1 Zoom R/A PS Friz  Turbo 9",null,null,{"$f":"IFERROR(IF(VLOOKUP($B38,Таблица1[],9,0)=0,\"\",VLOOKUP($B38,Таблица1[],9,0)),\"\")","v":""},{"$f":"IFERROR(VLOOKUP($B38,Таблица1[],16,0),\"\")","v":""},{"$f":"IFERROR(VLOOKUP($B38,Таблица1[],10,0),\"\")","v":""},{"$f":"IFERROR(VLOOKUP($B38,Таблица1[],11,0),\"\")","v":""},{"$f":"IFERROR(VLOOKUP($B38,Таблица1[],12,0),\"\")","v":""},{"$f":"IFERROR(VLOOKUP($B38,Таблица1[],13,0),\"\")","v":""},{"$f":"IFERROR(VLOOKUP($B38,Таблица1[],14,0),\"\")","v":""},{"$f":"COUNTIFS(Таблица1[2019],B38)+SUMIFS(Таблица1[Re-entry],Таблица1[2019],B38)","v":0},{"$f":"SUMIFS(Таблица1[Total Buy-In],Таблица1[2019],B38)","v":0},0,{"$f":"IFERROR(COUNTIFS(Таблица1[2019],B38,Таблица1[Winnings],\">0\")/L38*100,0)","v":0},{"$f":"SUMIFS(Таблица1[Total Hands],Таблица1[2019],B38)","v":0},{"$f":"IFERROR(SUMIFS(Таблица1[bb/101],Таблица1[2019],B38)/P38,0)","v":0},{"$f":"IFERROR(SUMIFS(Таблица1[EV bb/101],Таблица1[2019],B38)/P38,0)","v":0},{"$f":"SUMIFS(Таблица1[Net Winnings],Таблица1[2019],B38)","v":0},0]
[null,"10:00 1,1 Deep Payouts PS Friz  Regular 9",null,null,{"$f":"IFERROR(IF(VLOOKUP($B39,Таблица1[],9,0)=0,\"\",VLOOKUP($B39,Таблица1[],9,0)),\"\")","v":""},{"$f":"IFERROR(VLOOKUP($B39,Таблица1[],16,0),\"\")","v":""},{"$f":"IFERROR(VLOOKUP($B39,Таблица1[],10,0),\"\")","v":""},{"$f":"IFERROR(VLOOKUP($B39,Таблица1[],11,0),\"\")","v":""},{"$f":"IFERROR(VLOOKUP($B39,Таблица1[],12,0),\"\")","v":""},{"$f":"IFERROR(VLOOKUP($B39,Таблица1[],13,0),\"\")","v":""},{"$f":"IFERROR(VLOOKUP($B39,Таблица1[],14,0),\"\")","v":""},{"$f":"COUNTIFS(Таблица1[2019],B39)+SUMIFS(Таблица1[Re-entry],Таблица1[2019],B39)","v":0},{"$f":"SUMIFS(Таблица1[Total Buy-In],Таблица1[2019],B39)","v":0},0,{"$f":"IFERROR(COUNTIFS(Таблица1[2019],B39,Таблица1[Winnings],\">0\")/L39*100,0)","v":0},{"$f":"SUMIFS(Таблица1[Total Hands],Таблица1[2019],B39)","v":0},{"$f":"IFERROR(SUMIFS(Таблица1[bb/101],Таблица1[2019],B39)/P39,0)","v":0},{"$f":"IFERROR(SUMIFS(Таблица1[EV bb/101],Таблица1[2019],B39)/P39,0)","v":0},{"$f":"SUMIFS(Таблица1[Net Winnings],Таблица1[2019],B39)","v":0},0]
[null,"10:00 3 Gtd PAC Friz  Regular 9",null,null,{"$f":"IFERROR(IF(VLOOKUP($B40,Таблица1[],9,0)=0,\"\",VLOOKUP($B40,Таблица1[],9,0)),\"\")","v":""},{"$f":"IFERROR(VLOOKUP($B40,Таблица1[],16,0),\"\")","v":""},{"$f":"IFERROR(VLOOKUP($B40,Таблица1[],10,0),\"\")","v":""},{"$f":"IFERROR(VLOOKUP($B40,Таблица1[],11,0),\"\")","v":""},{"$f":"IFERROR(VLOOKUP($B40,Таблица1[],12,0),\"\")","v":""},{"$f":"IFERROR(VLOOKUP($B40,Таблица1[],13,0),\"\")","v":""},{"$f":"IFERROR(VLOOKUP($B40,Таблица1[],14,0),\"\")","v":""},{"$f":"COUNTIFS(Таблица1[2019],B40)+SUMIFS(Таблица1[Re-entry],Таблица1[2019],B40)","v":0},{"$f":"SUMIFS(Таблица1[Total Buy-In],Таблица1[2019],B40)","v":0},0,{"$f":"IFERROR(COUNTIFS(Таблица1[2019],B40,Таблица1[Winnings],\">0\")/L40*100,0)","v":0},{"$f":"SUMIFS(Таблица1[Total Hands],Таблица1[2019],B40)","v":0},{"$f":"IFERROR(SUMIFS(Таблица1[bb/101],Таблица1[2019],B40)/P40,0)","v":0},{"$f":"IFERROR(SUMIFS(Таблица1[EV bb/101],Таблица1[2019],B40)/P40,0)","v":0},{"$f":"SUMIFS(Таблица1[Net Winnings],Таблица1[2019],B40)","v":0},0]
[null,"10:20 2,2 Progressive KO PS KO  Turbo 9",null,null,{"$f":"IFERROR(IF(VLOOKUP($B41,Таблица1[],9,0)=0,\"\",VLOOKUP($B41,Таблица1[],9,0)),\"\")","v":""},{"$f":"IFERROR(VLOOKUP($B41,Таблица1[],16,0),\"\")","v":""},{"$f":"IFERROR(VLOOKUP($B41,Таблица1[],10,0),\"\")","v":""},{"$f":"IFERROR(VLOOKUP($B41,Таблица1[],11,0),\"\")","v":""},{"$f":"IFERROR(VLOOKUP($B41,Таблица1[],12,0),\"\")","v":""},{"$f":"IFERROR(VLOOKUP($B41,Таблица1[],13,0),\"\")","v":""},{"$f":"IFERROR(VLOOKUP($B41,Таблица1[],14,0),\"\")","v":""},{"$f":"COUNTIFS(Таблица1[2019],B41)+SUMIFS(Таблица1[Re-entry],Таблица1[2019],B41)","v":0},{"$f":"SUMIFS(Таблица1[Total Buy-In],Таблица1[2019],B41)","v":0},0,{"$f":"IFERROR(COUNTIFS(Таблица1[2019],B41,Таблица1[Winnings],\">0\")/L41*100,0)","v":0},{"$f":"SUMIFS(Таблица1[Total Hands],Таблица1[2019],B41)","v":0},{"$f":"IFERROR(SUMIFS(Таблица1[bb/101],Таблица1[2019],B41)/P41,0)","v":0},{"$f":"IFERROR(SUMIFS(Таблица1[EV bb/101],Таблица1[2019],B41)/P41,0)","v":0},{"$f":"SUMIFS(Таблица1[Net Winnings],Таблица1[2019],B41)","v":0},0]
[null,"10:25 1,1 Bubble Rush PS Friz  Turbo 9",null,null,{"$f":"IFERROR(IF(VLOOKUP($B42,Таблица1[],9,0)=0,\"\",VLOOKUP($B42,Таблица1[],9,0)),\"\")","v":""},{"$f":"IFERROR(VLOOKUP($B42,Таблица1[],16,0),\"\")","v":""},{"$f":"IFERROR(VLOOKUP($B42,Таблица1[],10,0),\"\")","v":""},{"$f":"IFERROR(VLOOKUP($B42,Таблица1[],11,0),\"\")","v":""},{"$f":"IFERROR(VLOOKUP($B42,Таблица1[],12,0),\"\")","v":""},{"$f":"IFERROR(VLOOKUP($B42,Таблица1[],13,0),\"\")","v":""},{"$f":"IFERROR(VLOOKUP($B42,Таблица1[],14,0),\"\")","v":""},{"$f":"COUNTIFS(Таблица1[2019],B42)+SUMIFS(Таблица1[Re-entry],Таблица1[2019],B42)","v":0},{"$f":"SUMIFS(Таблица1[Total Buy-In],Таблица1[2019],B42)","v":0},0,{"$f":"IFERROR(COUNTIFS(Таблица1[2019],B42,Таблица1[Winnings],\">0\")/L42*100,0)","v":0},{"$f":"SUMIFS(Таблица1[Total Hands],Таблица1[2019],B42)","v":0},{"$f":"IFERROR(SUMIFS(Таблица1[bb/101],Таблица1[2019],B42)/P42,0)","v":0},{"$f":"IFERROR(SUMIFS(Таблица1[EV bb/101],Таблица1[2019],B42)/P42,0)","v":0},{"$f":"SUMIFS(Таблица1[Net Winnings],Таблица1[2019],B42)","v":0},0]
[null,"10:30 1 Gtd ES Friz  Regular 9",null,null,{"$f":"IFERROR(IF(VLOOKUP($B43,Таблица1[],9,0)=0,\"\",VLOOKUP($B43,Таблица1[],9,0)),\"\")","v":""},{"$f":"IFERROR(VLOOKUP($B43,Таблица1[],16,0),\"\")","v":""},{"$f":"IFERROR(VLOOKUP($B43,Таблица1[],10,0),\"\")","v":""},{"$f":"IFERROR(VLOOKUP($B43,Таблица1[],11,0),\"\")","v":""},{"$f":"IFERROR(VLOOKUP($B43,Таблица1[],12,0),\"\")","v":""},{"$f":"IFERROR(VLOOKUP($B43,Таблица1[],13,0),\"\")","v":""},{"$f":"IFERROR(VLOOKUP($B43,Таблица1[],14,0),\"\")","v":""},{"$f":"COUNTIFS(Таблица1[2019],B43)+SUMIFS(Таблица1[Re-entry],Таблица1[2019],B43)","v":0},{"$f":"SUMIFS(Таблица1[Total Buy-In],Таблица1[2019],B43)","v":0},0,{"$f":"IFERROR(COUNTIFS(Таблица1[2019],B43,Таблица1[Winnings],\">0\")/L43*100,0)","v":0},{"$f":"SUMIFS(Таблица1[Total Hands],Таблица1[2019],B43)","v":0},{"$f":"IFERROR(SUMIFS(Таблица1[bb/101],Таблица1[2019],B43)/P43,0)","v":0},{"$f":"IFERROR(SUMIFS(Таблица1[EV bb/101],Таблица1[2019],B43)/P43,0)","v":0},{"$f":"SUMIFS(Таблица1[Net Winnings],Таблица1[2019],B43)","v":0},0]
[null,"10:40 1 Gtd R/A ES Friz  Turbo 9",null,null,{"$f":"IFERROR(IF(VLOOKUP($B44,Таблица1[],9,0)=0,\"\",VLOOKUP($B44,Таблица1[],9,0)),\"\")","v":""},{"$f":"IFERROR(VLOOKUP($B44,Таблица1[],16,0),\"\")","v":""},{"$f":"IFERROR(VLOOKUP($B44,Таблица1[],10,0),\"\")","v":""},{"$f":"IFERROR(VLOOKUP($B44,Таблица1[],11,0),\"\")","v":""},{"$f":"IFERROR(VLOOKUP($B44,Таблица1[],12,0),\"\")","v":""},{"$f":"IFERROR(VLOOKUP($B44,Таблица1[],13,0),\"\")","v":""},{"$f":"IFERROR(VLOOKUP($B44,Таблица1[],14,0),\"\")","v":""},{"$f":"COUNTIFS(Таблица1[2019],B44)+SUMIFS(Таблица1[Re-entry],Таблица1[2019],B44)","v":0},{"$f":"SUMIFS(Таблица1[Total Buy-In],Таблица1[2019],B44)","v":0},0,{"$f":"IFERROR(COUNTIFS(Таблица1[2019],B44,Таблица1[Winnings],\">0\")/L44*100,0)","v":0},{"$f":"SUMIFS(Таблица1[Total Hands],Таблица1[2019],B44)","v":0},{"$f":"IFERROR(SUMIFS(Таблица1[bb/101],Таблица1[2019],B44)/P44,0)","v":0},{"$f":"IFERROR(SUMIFS(Таблица1[EV bb/101],Таблица1[2019],B44)/P44,0)","v":0},{"$f":"SUMIFS(Таблица1[Net Winnings],Таблица1[2019],B44)","v":0},0]
[null,"10:45 1,1 Zoom PS Friz  Turbo 9",null,null,{"$f":"IFERROR(IF(VLOOKUP($B45,Таблица1[],9,0)=0,\"\",VLOOKUP($B45,Таблица1[],9,0)),\"\")","v":""},{"$f":"IFERROR(VLOOKUP($B45,Таблица1[],16,0),\"\")","v":""},{"$f":"IFERROR(VLOOKUP($B45,Таблица1[],10,0),\"\")","v":""},{"$f":"IFERROR(VLOOKUP($B45,Таблица1[],11,0),\"\")","v":""},{"$f":"IFERROR(VLOOKUP($B45,Таблица1[],12,0),\"\")","v":""},{"$f":"IFERROR(VLOOKUP($B45,Таблица1[],13,0),\"\")","v":""},{"$f":"IFERROR(VLOOKUP($B45,Таблица1[],14,0),\"\")","v":""},{"$f":"COUNTIFS(Таблица1[2019],B45)+SUMIFS(Таблица1[Re-entry],Таблица1[2019],B45)","v":0},{"$f":"SUMIFS(Таблица1[Total Buy-In],Таблица1[2019],B45)","v":0},0,{"$f":"IFERROR(COUNTIFS(Таблица1[2019],B45,Таблица1[Winnings],\">0\")/L45*100,0)","v":0},{"$f":"SUMIFS(Таблица1[Total Hands],Таблица1[2019],B45)","v":0},{"$f":"IFERROR(SUMIFS(Таблица1[bb/101],Таблица1[2019],B45)/P45,0)","v":0},{"$f":"IFERROR(SUMIFS(Таблица1[EV bb/101],Таблица1[2019],B45)/P45,0)","v":0},{"$f":"SUMIFS(Таблица1[Net Winnings],Таблица1[2019],B45)","v":0},0]
[null,"11:00 12 Catfish PAC Friz  Regular 10",null,null,{"$f":"IFERROR(IF(VLOOKUP($B46,Таблица1[],9,0)=0,\"\",VLOOKUP($B46,Таблица1[],9,0)),\"\")","v":""},{"$f":"IFERROR(VLOOKUP($B46,Таблица1[],16,0),\"\")","v":""},{"$f":"IFERROR(VLOOKUP($B46,Таблица1[],10,0),\"\")","v":""},{"$f":"IFERROR(VLOOKUP($B46,Таблица1[],11,0),\"\")","v":""},{"$f":"IFERROR(VLOOKUP($B46,Таблица1[],12,0),\"\")","v":""},{"$f":"IFERROR(VLOOKUP($B46,Таблица1[],13,0),\"\")","v":""},{"$f":"IFERROR(VLOOKUP($B46,Таблица1[],14,0),\"\")","v":""},{"$f":"COUNTIFS(Таблица1[2019],B46)+SUMIFS(Таблица1[Re-entry],Таблица1[2019],B46)","v":0},{"$f":"SUMIFS(Таблица1[Total Buy-In],Таблица1[2019],B46)","v":0},{"$f":"IFERROR((S46/M46)*100,0)","v":0},{"$f":"IFERROR(COUNTIFS(Таблица1[2019],B46,Таблица1[Winnings],\">0\")/L46*100,0)","v":0},{"$f":"SUMIFS(Таблица1[Total Hands],Таблица1[2019],B46)","v":0},{"$f":"IFERROR(SUMIFS(Таблица1[bb/101],Таблица1[2019],B46)/P46,0)","v":0},{"$f":"IFERROR(SUMIFS(Таблица1[EV bb/101],Таблица1[2019],B46)/P46,0)","v":0},{"$f":"SUMIFS(Таблица1[Net Winnings],Таблица1[2019],B46)","v":0},{"$f":"IFERROR(S46/L46,0)","v":0}]
[null,"11:15 5 6-Max Club ES Friz  Regular 6",null,null,{"$f":"IFERROR(IF(VLOOKUP($B47,Таблица1[],9,0)=0,\"\",VLOOKUP($B47,Таблица1[],9,0)),\"\")","v":""},{"$f":"IFERROR(VLOOKUP($B47,Таблица1[],16,0),\"\")","v":""},{"$f":"IFERROR(VLOOKUP($B47,Таблица1[],10,0),\"\")","v":""},{"$f":"IFERROR(VLOOKUP($B47,Таблица1[],11,0),\"\")","v":""},{"$f":"IFERROR(VLOOKUP($B47,Таблица1[],12,0),\"\")","v":""},{"$f":"IFERROR(VLOOKUP($B47,Таблица1[],13,0),\"\")","v":""},{"$f":"IFERROR(VLOOKUP($B47,Таблица1[],14,0),\"\")","v":""},{"$f":"COUNTIFS(Таблица1[2019],B47)+SUMIFS(Таблица1[Re-entry],Таблица1[2019],B47)","v":0},{"$f":"SUMIFS(Таблица1[Total Buy-In],Таблица1[2019],B47)","v":0},0,{"$f":"IFERROR(COUNTIFS(Таблица1[2019],B47,Таблица1[Winnings],\">0\")/L47*100,0)","v":0},{"$f":"SUMIFS(Таблица1[Total Hands],Таблица1[2019],B47)","v":0},{"$f":"IFERROR(SUMIFS(Таблица1[bb/101],Таблица1[2019],B47)/P47,0)","v":0},{"$f":"IFERROR(SUMIFS(Таблица1[EV bb/101],Таблица1[2019],B47)/P47,0)","v":0},{"$f":"SUMIFS(Таблица1[Net Winnings],Таблица1[2019],B47)","v":0},0]
[null,"11:15 7,5 Deep Stacks PS Friz  Regular 9",null,null,{"$f":"IFERROR(IF(VLOOKUP($B48,Таблица1[],9,0)=0,\"\",VLOOKUP($B48,Таблица1[],9,0)),\"\")","v":""},{"$f":"IFERROR(VLOOKUP($B48,Таблица1[],16,0),\"\")","v":""},{"$f":"IFERROR(VLOOKUP($B48,Таблица1[],10,0),\"\")","v":""},{"$f":"IFERROR(VLOOKUP($B48,Таблица1[],11,0),\"\")","v":""},{"$f":"IFERROR(VLOOKUP($B48,Таблица1[],12,0),\"\")","v":""},{"$f":"IFERROR(VLOOKUP($B48,Таблица1[],13,0),\"\")","v":""},{"$f":"IFERROR(VLOOKUP($B48,Таблица1[],14,0),\"\")","v":""},{"$f":"COUNTIFS(Таблица1[2019],B48)+SUMIFS(Таблица1[Re-entry],Таблица1[2019],B48)","v":0},{"$f":"SUMIFS(Таблица1[Total Buy-In],Таблица1[2019],B48)","v":0},0,{"$f":"IFERROR(COUNTIFS(Таблица1[2019],B48,Таблица1[Winnings],\">0\")/L48*100,0)","v":0},{"$f":"SUMIFS(Таблица1[Total Hands],Таблица1[2019],B48)","v":0},{"$f":"IFERROR(SUMIFS(Таблица1[bb/101],Таблица1[2019],B48)/P48,0)","v":0},{"$f":"IFERROR(SUMIFS(Таблица1[EV bb/101],Таблица1[2019],B48)/P48,0)","v":0},{"$f":"SUMIFS(Таблица1[Net Winnings],Таблица1[2019],B48)","v":0},0]
[null,"11:20 1,1 Gtd R/A PS Friz  Regular 9",null,null,{"$f":"IFERROR(IF(VLOOKUP($B49,Таблица1[],9,0)=0,\"\",VLOOKUP($B49,Таблица1[],9,0)),\"\")","v":""},{"$f":"IFERROR(VLOOKUP($B49,Таблица1[],16,0),\"\")","v":""},{"$f":"IFERROR(VLOOKUP($B49,Таблица1[],10,0),\"\")","v":""},{"$f":"IFERROR(VLOOKUP($B49,Таблица1[],11,0),\"\")","v":""},{"$f":"IFERROR(VLOOKUP($B49,Таблица1[],12,0),\"\")","v":""},{"$f":"IFERROR(VLOOKUP($B49,Таблица1[],13,0),\"\")","v":""},{"$f":"IFERROR(VLOOKUP($B49,Таблица1[],14,0),\"\")","v":""},{"$f":"COUNTIFS(Таблица1[2019],B49)+SUMIFS(Таблица1[Re-entry],Таблица1[2019],B49)","v":0},{"$f":"SUMIFS(Таблица1[Total Buy-In],Таблица1[2019],B49)","v":0},0,{"$f":"IFERROR(COUNTIFS(Таблица1[2019],B49,Таблица1[Winnings],\">0\")/L49*100,0)","v":0},{"$f":"SUMIFS(Таблица1[Total Hands],Таблица1[2019],B49)","v":0},{"$f":"IFERROR(SUMIFS(Таблица1[bb/101],Таблица1[2019],B49)/P49,0)","v":0},{"$f":"IFERROR(SUMIFS(Таблица1[EV bb/101],Таблица1[2019],B49)/P49,0)","v":0},{"$f":"SUMIFS(Таблица1[Net Winnings],Таблица1[2019],B49)","v":0},0]
[null,"11:30 1 SuperStack ES Friz  Regular 6",null,null,{"$f":"IFERROR(IF(VLOOKUP($B50,Таблица1[],9,0)=0,\"\",VLOOKUP($B50,Таблица1[],9,0)),\"\")","v":""},{"$f":"IFERROR(VLOOKUP($B50,Таблица1[],16,0),\"\")","v":""},{"$f":"IFERROR(VLOOKUP($B50,Таблица1[],10,0),\"\")","v":""},{"$f":"IFERROR(VLOOKUP($B50,Таблица1[],11,0),\"\")","v":""},{"$f":"IFERROR(VLOOKUP($B50,Таблица1[],12,0),\"\")","v":""},{"$f":"IFERROR(VLOOKUP($B50,Таблица1[],13,0),\"\")","v":""},{"$f":"IFERROR(VLOOKUP($B50,Таблица1[],14,0),\"\")","v":""},{"$f":"COUNTIFS(Таблица1[2019],B50)+SUMIFS(Таблица1[Re-entry],Таблица1[2019],B50)","v":0},{"$f":"SUMIFS(Таблица1[Total Buy-In],Таблица1[2019],B50)","v":0},0,{"$f":"IFERROR(COUNTIFS(Таблица1[2019],B50,Таблица1[Winnings],\">0\")/L50*100,0)","v":0},{"$f":"SUMIFS(Таблица1[Total Hands],Таблица1[2019],B50)","v":0},{"$f":"IFERROR(SUMIFS(Таблица1[bb/101],Таблица1[2019],B50)/P50,0)","v":0},{"$f":"IFERROR(SUMIFS(Таблица1[EV bb/101],Таблица1[2019],B50)/P50,0)","v":0},{"$f":"SUMIFS(Таблица1[Net Winnings],Таблица1[2019],B50)","v":0},0]
[null,"11:30 3 Gtd ES Friz  Regular 9",null,null,{"$f":"IFERROR(IF(VLOOKUP($B51,Таблица1[],9,0)=0,\"\",VLOOKUP($B51,Таблица1[],9,0)),\"\")","v":""},{"$f":"IFERROR(VLOOKUP($B51,Таблица1[],16,0),\"\")","v":""},{"$f":"IFERROR(VLOOKUP($B51,Таблица1[],10,0),\"\")","v":""},{"$f":"IFERROR(VLOOKUP($B51,Таблица1[],11,0),\"\")","v":""},{"$f":"IFERROR(VLOOKUP($B51,Таблица1[],12,0),\"\")","v":""},{"$f":"IFERROR(VLOOKUP($B51,Таблица1[],13,0),\"\")","v":""},{"$f":"IFERROR(VLOOKUP($B51,Таблица1[],14,0),\"\")","v":""},{"$f":"COUNTIFS(Таблица1[2019],B51)+SUMIFS(Таблица1[Re-entry],Таблица1[2019],B51)","v":0},{"$f":"SUMIFS(Таблица1[Total Buy-In],Таблица1[2019],B51)","v":0},0,{"$f":"IFERROR(COUNTIFS(Таблица1[2019],B51,Таблица1[Winnings],\">0\")/L51*100,0)","v":0},{"$f":"SUMIFS(Таблица1[Total Hands],Таблица1[2019],B51)","v":0},{"$f":"IFERROR(SUMIFS(Таблица1[bb/101],Таблица1[2019],B51)/P51,0)","v":0},{"$f":"IFERROR(SUMIFS(Таблица1[EV bb/101],Таблица1[2019],B51)/P51,0)","v":0},{"$f":"SUMIFS(Таблица1[Net Winnings],Таблица1[2019],B51)","v":0},0]
[null,"11:40 3,3 Gtd PS Friz  Regular 9",null,null,{"$f":"IFERROR(IF(VLOOKUP($B52,Таблица1[],9,0)=0,\"\",VLOOKUP($B52,Таблица1[],9,0)),\"\")","v":""},{"$f":"IFERROR(VLOOKUP($B52,Таблица1[],16,0),\"\")","v":""},{"$f":"IFERROR(VLOOKUP($B52,Таблица1[],10,0),\"\")","v":""},{"$f":"IFERROR(VLOOKUP($B52,Таблица1[],11,0),\"\")","v":""},{"$f":"IFERROR(VLOOKUP($B52,Таблица1[],12,0),\"\")","v":""},{"$f":"IFERROR(VLOOKUP($B52,Таблица1[],13,0),\"\")","v":""},{"$f":"IFERROR(VLOOKUP($B52,Таблица1[],14,0),\"\")","v":""},{"$f":"COUNTIFS(Таблица1[2019],B52)+SUMIFS(Таблица1[Re-entry],Таблица1[2019],B52)","v":0},{"$f":"SUMIFS(Таблица1[Total Buy-In],Таблица1[2019],B52)","v":0},0,{"$f":"IFERROR(COUNTIFS(Таблица1[2019],B52,Таблица1[Winnings],\">0\")/L52*100,0)","v":0},{"$f":"SUMIFS(Таблица1[Total Hands],Таблица1[2019],B52)","v":0},{"$f":"IFERROR(SUMIFS(Таблица1[bb/101],Таблица1[2019],B52)/P52,0)","v":0},{"$f":"IFERROR(SUMIFS(Таблица1[EV bb/101],Таблица1[2019],B52)/P52,0)","v":0},{"$f":"SUMIFS(Таблица1[Net Winnings],Таблица1[2019],B52)","v":0},0]
[null,"11:45 1,1 Gtd PS Friz  Turbo 6",null,null,{"$f":"IFERROR(IF(VLOOKUP($B53,Таблица1[],9,0)=0,\"\",VLOOKUP($B53,Таблица1[],9,0)),\"\")","v":""},{"$f":"IFERROR(VLOOKUP($B53,Таблица1[],16,0),\"\")","v":""},{"$f":"IFERROR(VLOOKUP($B53,Таблица1[],10,0),\"\")","v":""},{"$f":"IFERROR(VLOOKUP($B53,Таблица1[],11,0),\"\")","v":""},{"$f":"IFERROR(VLOOKUP($B53,Таблица1[],12,0),\"\")","v":""},{"$f":"IFERROR(VLOOKUP($B53,Таблица1[],13,0),\"\")","v":""},{"$f":"IFERROR(VLOOKUP($B53,Таблица1[],14,0),\"\")","v":""},{"$f":"COUNTIFS(Таблица1[2019],B53)+SUMIFS(Таблица1[Re-entry],Таблица1[2019],B53)","v":0},{"$f":"SUMIFS(Таблица1[Total Buy-In],Таблица1[2019],B53)","v":0},0,{"$f":"IFERROR(COUNTIFS(Таблица1[2019],B53,Таблица1[Winnings],\">0\")/L53*100,0)","v":0},{"$f":"SUMIFS(Таблица1[Total Hands],Таблица1[2019],B53)","v":0},{"$f":"IFERROR(SUMIFS(Таблица1[bb/101],Таблица1[2019],B53)/P53,0)","v":0},{"$f":"IFERROR(SUMIFS(Таблица1[EV bb/101],Таблица1[2019],B53)/P53,0)","v":0},{"$f":"SUMIFS(Таблица1[Net Winnings],Таблица1[2019],B53)","v":0},0]
[null,"11:50 1 Gtd ES Friz  Regular 9",null,null,{"$f":"IFERROR(IF(VLOOKUP($B54,Таблица1[],9,0)=0,\"\",VLOOKUP($B54,Таблица1[],9,0)),\"\")","v":""},{"$f":"IFERROR(VLOOKUP($B54,Таблица1[],16,0),\"\")","v":""},{"$f":"IFERROR(VLOOKUP($B54,Таблица1[],10,0),\"\")","v":""},{"$f":"IFERROR(VLOOKUP($B54,Таблица1[],11,0),\"\")","v":""},{"$f":"IFERROR(VLOOKUP($B54,Таблица1[],12,0),\"\")","v":""},{"$f":"IFERROR(VLOOKUP($B54,Таблица1[],13,0),\"\")","v":""},{"$f":"IFERROR(VLOOKUP($B54,Таблица1[],14,0),\"\")","v":""},{"$f":"COUNTIFS(Таблица1[2019],B54)+SUMIFS(Таблица1[Re-entry],Таблица1[2019],B54)","v":0},{"$f":"SUMIFS(Таблица1[Total Buy-In],Таблица1[2019],B54)","v":0},0,{"$f":"IFERROR(COUNTIFS(Таблица1[2019],B54,Таблица1[Winnings],\">0\")/L54*100,0)","v":0},{"$f":"SUMIFS(Таблица1[Total Hands],Таблица1[2019],B54)","v":0},{"$f":"IFERROR(SUMIFS(Таблица1[bb/101],Таблица1[2019],B54)/P54,0)","v":0},{"$f":"IFERROR(SUMIFS(Таблица1[EV bb/101],Таблица1[2019],B54)/P54,0)","v":0},{"$f":"SUMIFS(Таблица1[Net Winnings],Таблица1[2019],B54)","v":0},0]
[null,"11:50 2,2 Bubble Rush PS Friz  Turbo 9",null,null,{"$f":"IFERROR(IF(VLOOKUP($B55,Таблица1[],9,0)=0,\"\",VLOOKUP($B55,Таблица1[],9,0)),\"\")","v":""},{"$f":"IFERROR(VLOOKUP($B55,Таблица1[],16,0),\"\")","v":""},{"$f":"IFERROR(VLOOKUP($B55,Таблица1[],10,0),\"\")","v":""},{"$f":"IFERROR(VLOOKUP($B55,Таблица1[],11,0),\"\")","v":""},{"$f":"IFERROR(VLOOKUP($B55,Таблица1[],12,0),\"\")","v":""},{"$f":"IFERROR(VLOOKUP($B55,Таблица1[],13,0),\"\")","v":""},{"$f":"IFERROR(VLOOKUP($B55,Таблица1[],14,0),\"\")","v":""},{"$f":"COUNTIFS(Таблица1[2019],B55)+SUMIFS(Таблица1[Re-entry],Таблица1[2019],B55)","v":0},{"$f":"SUMIFS(Таблица1[Total Buy-In],Таблица1[2019],B55)","v":0},0,{"$f":"IFERROR(COUNTIFS(Таблица1[2019],B55,Таблица1[Winnings],\">0\")/L55*100,0)","v":0},{"$f":"SUMIFS(Таблица1[Total Hands],Таблица1[2019],B55)","v":0},{"$f":"IFERROR(SUMIFS(Таблица1[bb/101],Таблица1[2019],B55)/P55,0)","v":0},{"$f":"IFERROR(SUMIFS(Таблица1[EV bb/101],Таблица1[2019],B55)/P55,0)","v":0},{"$f":"SUMIFS(Таблица1[Net Winnings],Таблица1[2019],B55)","v":0},0]
[null,"12:00 1,1 Big PS Friz  Regular 9",null,null,{"$f":"IFERROR(IF(VLOOKUP($B56,Таблица1[],9,0)=0,\"\",VLOOKUP($B56,Таблица1[],9,0)),\"\")","v":""},{"$f":"IFERROR(VLOOKUP($B56,Таблица1[],16,0),\"\")","v":""},{"$f":"IFERROR(VLOOKUP($B56,Таблица1[],10,0),\"\")","v":""},{"$f":"IFERROR(VLOOKUP($B56,Таблица1[],11,0),\"\")","v":""},{"$f":"IFERROR(VLOOKUP($B56,Таблица1[],12,0),\"\")","v":""},{"$f":"IFERROR(VLOOKUP($B56,Таблица1[],13,0),\"\")","v":""},{"$f":"IFERROR(VLOOKUP($B56,Таблица1[],14,0),\"\")","v":""},{"$f":"COUNTIFS(Таблица1[2019],B56)+SUMIFS(Таблица1[Re-entry],Таблица1[2019],B56)","v":0},{"$f":"SUMIFS(Таблица1[Total Buy-In],Таблица1[2019],B56)","v":0},0,{"$f":"IFERROR(COUNTIFS(Таблица1[2019],B56,Таблица1[Winnings],\">0\")/L56*100,0)","v":0},{"$f":"SUMIFS(Таблица1[Total Hands],Таблица1[2019],B56)","v":0},{"$f":"IFERROR(SUMIFS(Таблица1[bb/101],Таблица1[2019],B56)/P56,0)","v":0},{"$f":"IFERROR(SUMIFS(Таблица1[EV bb/101],Таблица1[2019],B56)/P56,0)","v":0},{"$f":"SUMIFS(Таблица1[Net Winnings],Таблица1[2019],B56)","v":0},0]
[null,"12:00 11 Progressive KO PAC KO  Regular 9",null,null,{"$f":"IFERROR(IF(VLOOKUP($B57,Таблица1[],9,0)=0,\"\",VLOOKUP($B57,Таблица1[],9,0)),\"\")","v":""},{"$f":"IFERROR(VLOOKUP($B57,Таблица1[],16,0),\"\")","v":""},{"$f":"IFERROR(VLOOKUP($B57,Таблица1[],10,0),\"\")","v":""},{"$f":"IFERROR(VLOOKUP($B57,Таблица1[],11,0),\"\")","v":""},{"$f":"IFERROR(VLOOKUP($B57,Таблица1[],12,0),\"\")","v":""},{"$f":"IFERROR(VLOOKUP($B57,Таблица1[],13,0),\"\")","v":""},{"$f":"IFERROR(VLOOKUP($B57,Таблица1[],14,0),\"\")","v":""},{"$f":"COUNTIFS(Таблица1[2019],B57)+SUMIFS(Таблица1[Re-entry],Таблица1[2019],B57)","v":0},{"$f":"SUMIFS(Таблица1[Total Buy-In],Таблица1[2019],B57)","v":0},0,{"$f":"IFERROR(COUNTIFS(Таблица1[2019],B57,Таблица1[Winnings],\">0\")/L57*100,0)","v":0},{"$f":"SUMIFS(Таблица1[Total Hands],Таблица1[2019],B57)","v":0},{"$f":"IFERROR(SUMIFS(Таблица1[bb/101],Таблица1[2019],B57)/P57,0)","v":0},{"$f":"IFERROR(SUMIFS(Таблица1[EV bb/101],Таблица1[2019],B57)/P57,0)","v":0},{"$f":"SUMIFS(Таблица1[Net Winnings],Таблица1[2019],B57)","v":0},0]
[null,"12:15 3,3 Hot PS Friz  Turbo 9",null,null,{"$f":"IFERROR(IF(VLOOKUP($B58,Таблица1[],9,0)=0,\"\",VLOOKUP($B58,Таблица1[],9,0)),\"\")","v":""},{"$f":"IFERROR(VLOOKUP($B58,Таблица1[],16,0),\"\")","v":""},{"$f":"IFERROR(VLOOKUP($B58,Таблица1[],10,0),\"\")","v":""},{"$f":"IFERROR(VLOOKUP($B58,Таблица1[],11,0),\"\")","v":""},{"$f":"IFERROR(VLOOKUP($B58,Таблица1[],12,0),\"\")","v":""},{"$f":"IFERROR(VLOOKUP($B58,Таблица1[],13,0),\"\")","v":""},{"$f":"IFERROR(VLOOKUP($B58,Таблица1[],14,0),\"\")","v":""},{"$f":"COUNTIFS(Таблица1[2019],B58)+SUMIFS(Таблица1[Re-entry],Таблица1[2019],B58)","v":0},{"$f":"SUMIFS(Таблица1[Total Buy-In],Таблица1[2019],B58)","v":0},0,{"$f":"IFERROR(COUNTIFS(Таблица1[2019],B58,Таблица1[Winnings],\">0\")/L58*100,0)","v":0},{"$f":"SUMIFS(Таблица1[Total Hands],Таблица1[2019],B58)","v":0},{"$f":"IFERROR(SUMIFS(Таблица1[bb/101],Таблица1[2019],B58)/P58,0)","v":0},{"$f":"IFERROR(SUMIFS(Таблица1[EV bb/101],Таблица1[2019],B58)/P58,0)","v":0},{"$f":"SUMIFS(Таблица1[Net Winnings],Таблица1[2019],B58)","v":0},0]
[null,"12:30 1 Gtd PAC Friz  Regular 9",null,null,{"$f":"IFERROR(IF(VLOOKUP($B59,Таблица1[],9,0)=0,\"\",VLOOKUP($B59,Таблица1[],9,0)),\"\")","v":""},{"$f":"IFERROR(VLOOKUP($B59,Таблица1[],16,0),\"\")","v":""},{"$f":"IFERROR(VLOOKUP($B59,Таблица1[],10,0),\"\")","v":""},{"$f":"IFERROR(VLOOKUP($B59,Таблица1[],11,0),\"\")","v":""},{"$f":"IFERROR(VLOOKUP($B59,Таблица1[],12,0),\"\")","v":""},{"$f":"IFERROR(VLOOKUP($B59,Таблица1[],13,0),\"\")","v":""},{"$f":"IFERROR(VLOOKUP($B59,Таблица1[],14,0),\"\")","v":""},{"$f":"COUNTIFS(Таблица1[2019],B59)+SUMIFS(Таблица1[Re-entry],Таблица1[2019],B59)","v":0},{"$f":"SUMIFS(Таблица1[Total Buy-In],Таблица1[2019],B59)","v":0},0,{"$f":"IFERROR(COUNTIFS(Таблица1[2019],B59,Таблица1[Winnings],\">0\")/L59*100,0)","v":0},{"$f":"SUMIFS(Таблица1[Total Hands],Таблица1[2019],B59)","v":0},{"$f":"IFERROR(SUMIFS(Таблица1[bb/101],Таблица1[2019],B59)/P59,0)","v":0},{"$f":"IFERROR(SUMIFS(Таблица1[EV bb/101],Таблица1[2019],B59)/P59,0)","v":0},{"$f":"SUMIFS(Таблица1[Net Winnings],Таблица1[2019],B59)","v":0},0]
[null,"12:30 1,1 MicroMillions PS Friz  Regular 8",null,null,{"$f":"IFERROR(IF(VLOOKUP($B60,Таблица1[],9,0)=0,\"\",VLOOKUP($B60,Таблица1[],9,0)),\"\")","v":""},{"$f":"IFERROR(VLOOKUP($B60,Таблица1[],16,0),\"\")","v":""},{"$f":"IFERROR(VLOOKUP($B60,Таблица1[],10,0),\"\")","v":""},{"$f":"IFERROR(VLOOKUP($B60,Таблица1[],11,0),\"\")","v":""},{"$f":"IFERROR(VLOOKUP($B60,Таблица1[],12,0),\"\")","v":""},{"$f":"IFERROR(VLOOKUP($B60,Таблица1[],13,0),\"\")","v":""},{"$f":"IFERROR(VLOOKUP($B60,Таблица1[],14,0),\"\")","v":""},{"$f":"COUNTIFS(Таблица1[2019],B60)+SUMIFS(Таблица1[Re-entry],Таблица1[2019],B60)","v":0},{"$f":"SUMIFS(Таблица1[Total Buy-In],Таблица1[2019],B60)","v":0},0,{"$f":"IFERROR(COUNTIFS(Таблица1[2019],B60,Таблица1[Winnings],\">0\")/L60*100,0)","v":0},{"$f":"SUMIFS(Таблица1[Total Hands],Таблица1[2019],B60)","v":0},{"$f":"IFERROR(SUMIFS(Таблица1[bb/101],Таблица1[2019],B60)/P60,0)","v":0},{"$f":"IFERROR(SUMIFS(Таблица1[EV bb/101],Таблица1[2019],B60)/P60,0)","v":0},{"$f":"SUMIFS(Таблица1[Net Winnings],Таблица1[2019],B60)","v":0},0]
[null,"12:30 1,1 MicroMillions PS Friz  Regular 9",null,null,{"$f":"IFERROR(IF(VLOOKUP($B61,Таблица1[],9,0)=0,\"\",VLOOKUP($B61,Таблица1[],9,0)),\"\")","v":""},{"$f":"IFERROR(VLOOKUP($B61,Таблица1[],16,0),\"\")","v":""},{"$f":"IFERROR(VLOOKUP($B61,Таблица1[],10,0),\"\")","v":""},{"$f":"IFERROR(VLOOKUP($B61,Таблица1[],11,0),\"\")","v":""},{"$f":"IFERROR(VLOOKUP($B61,Таблица1[],12,0),\"\")","v":""},{"$f":"IFERROR(VLOOKUP($B61,Таблица1[],13,0),\"\")","v":""},{"$f":"IFERROR(VLOOKUP($B61,Таблица1[],14,0),\"\")","v":""},{"$f":"COUNTIFS(Таблица1[2019],B61)+SUMIFS(Таблица1[Re-entry],Таблица1[2019],B61)","v":0},{"$f":"SUMIFS(Таблица1[Total Buy-In],Таблица1[2019],B61)","v":0},0,{"$f":"IFERROR(COUNTIFS(Таблица1[2019],B61,Таблица1[Winnings],\">0\")/L61*100,0)","v":0},{"$f":"SUMIFS(Таблица1[Total Hands],Таблица1[2019],B61)","v":0},{"$f":"IFERROR(SUMIFS(Таблица1[bb/101],Таблица1[2019],B61)/P61,0)","v":0},{"$f":"IFERROR(SUMIFS(Таблица1[EV bb/101],Таблица1[2019],B61)/P61,0)","v":0},{"$f":"SUMIFS(Таблица1[Net Winnings],Таблица1[2019],B61)","v":0},0]
[null,"12:30 3 Progressive KO ES KO  Regular 9",null,null,{"$f":"IFERROR(IF(VLOOKUP($B62,Таблица1[],9,0)=0,\"\",VLOOKUP($B62,Таблица1[],9,0)),\"\")","v":""},{"$f":"IFERROR(VLOOKUP($B62,Таблица1[],16,0),\"\")","v":""},{"$f":"IFERROR(VLOOKUP($B62,Таблица1[],10,0),\"\")","v":""},{"$f":"IFERROR(VLOOKUP($B62,Таблица1[],11,0),\"\")","v":""},{"$f":"IFERROR(VLOOKUP($B62,Таблица1[],12,0),\"\")","v":""},{"$f":"IFERROR(VLOOKUP($B62,Таблица1[],13,0),\"\")","v":""},{"$f":"IFERROR(VLOOKUP($B62,Таблица1[],14,0),\"\")","v":""},{"$f":"COUNTIFS(Таблица1[2019],B62)+SUMIFS(Таблица1[Re-entry],Таблица1[2019],B62)","v":0},{"$f":"SUMIFS(Таблица1[Total Buy-In],Таблица1[2019],B62)","v":0},0,{"$f":"IFERROR(COUNTIFS(Таблица1[2019],B62,Таблица1[Winnings],\">0\")/L62*100,0)","v":0},{"$f":"SUMIFS(Таблица1[Total Hands],Таблица1[2019],B62)","v":0},{"$f":"IFERROR(SUMIFS(Таблица1[bb/101],Таблица1[2019],B62)/P62,0)","v":0},{"$f":"IFERROR(SUMIFS(Таблица1[EV bb/101],Таблица1[2019],B62)/P62,0)","v":0},{"$f":"SUMIFS(Таблица1[Net Winnings],Таблица1[2019],B62)","v":0},0]
[null,"12:30 3,3 MicroMillions PS KO  Regular 9",null,null,{"$f":"IFERROR(IF(VLOOKUP($B63,Таблица1[],9,0)=0,\"\",VLOOKUP($B63,Таблица1[],9,0)),\"\")","v":""},{"$f":"IFERROR(VLOOKUP($B63,Таблица1[],16,0),\"\")","v":""},{"$f":"IFERROR(VLOOKUP($B63,Таблица1[],10,0),\"\")","v":""},{"$f":"IFERROR(VLOOKUP($B63,Таблица1[],11,0),\"\")","v":""},{"$f":"IFERROR(VLOOKUP($B63,Таблица1[],12,0),\"\")","v":""},{"$f":"IFERROR(VLOOKUP($B63,Таблица1[],13,0),\"\")","v":""},{"$f":"IFERROR(VLOOKUP($B63,Таблица1[],14,0),\"\")","v":""},{"$f":"COUNTIFS(Таблица1[2019],B63)+SUMIFS(Таблица1[Re-entry],Таблица1[2019],B63)","v":0},{"$f":"SUMIFS(Таблица1[Total Buy-In],Таблица1[2019],B63)","v":0},0,{"$f":"IFERROR(COUNTIFS(Таблица1[2019],B63,Таблица1[Winnings],\">0\")/L63*100,0)","v":0},{"$f":"SUMIFS(Таблица1[Total Hands],Таблица1[2019],B63)","v":0},{"$f":"IFERROR(SUMIFS(Таблица1[bb/101],Таблица1[2019],B63)/P63,0)","v":0},{"$f":"IFERROR(SUMIFS(Таблица1[EV bb/101],Таблица1[2019],B63)/P63,0)","v":0},{"$f":"SUMIFS(Таблица1[Net Winnings],Таблица1[2019],B63)","v":0},0]
[null,"12:30 5,5 MicroMillions PS Friz  Regular 9",null,null,{"$f":"IFERROR(IF(VLOOKUP($B64,Таблица1[],9,0)=0,\"\",VLOOKUP($B64,Таблица1[],9,0)),\"\")","v":""},{"$f":"IFERROR(VLOOKUP($B64,Таблица1[],16,0),\"\")","v":""},{"$f":"IFERROR(VLOOKUP($B64,Таблица1[],10,0),\"\")","v":""},{"$f":"IFERROR(VLOOKUP($B64,Таблица1[],11,0),\"\")","v":""},{"$f":"IFERROR(VLOOKUP($B64,Таблица1[],12,0),\"\")","v":""},{"$f":"IFERROR(VLOOKUP($B64,Таблица1[],13,0),\"\")","v":""},{"$f":"IFERROR(VLOOKUP($B64,Таблица1[],14,0),\"\")","v":""},{"$f":"COUNTIFS(Таблица1[2019],B64)+SUMIFS(Таблица1[Re-entry],Таблица1[2019],B64)","v":0},{"$f":"SUMIFS(Таблица1[Total Buy-In],Таблица1[2019],B64)","v":0},0,{"$f":"IFERROR(COUNTIFS(Таблица1[2019],B64,Таблица1[Winnings],\">0\")/L64*100,0)","v":0},{"$f":"SUMIFS(Таблица1[Total Hands],Таблица1[2019],B64)","v":0},{"$f":"IFERROR(SUMIFS(Таблица1[bb/101],Таблица1[2019],B64)/P64,0)","v":0},{"$f":"IFERROR(SUMIFS(Таблица1[EV bb/101],Таблица1[2019],B64)/P64,0)","v":0},{"$f":"SUMIFS(Таблица1[Net Winnings],Таблица1[2019],B64)","v":0},0]
[null,"12:40 1,1 Progressive KO PS KO  Turbo 9",null,null,{"$f":"IFERROR(IF(VLOOKUP($B65,Таблица1[],9,0)=0,\"\",VLOOKUP($B65,Таблица1[],9,0)),\"\")","v":""},{"$f":"IFERROR(VLOOKUP($B65,Таблица1[],16,0),\"\")","v":""},{"$f":"IFERROR(VLOOKUP($B65,Таблица1[],10,0),\"\")","v":""},{"$f":"IFERROR(VLOOKUP($B65,Таблица1[],11,0),\"\")","v":""},{"$f":"IFERROR(VLOOKUP($B65,Таблица1[],12,0),\"\")","v":""},{"$f":"IFERROR(VLOOKUP($B65,Таблица1[],13,0),\"\")","v":""},{"$f":"IFERROR(VLOOKUP($B65,Таблица1[],14,0),\"\")","v":""},{"$f":"COUNTIFS(Таблица1[2019],B65)+SUMIFS(Таблица1[Re-entry],Таблица1[2019],B65)","v":0},{"$f":"SUMIFS(Таблица1[Total Buy-In],Таблица1[2019],B65)","v":0},0,{"$f":"IFERROR(COUNTIFS(Таблица1[2019],B65,Таблица1[Winnings],\">0\")/L65*100,0)","v":0},{"$f":"SUMIFS(Таблица1[Total Hands],Таблица1[2019],B65)","v":0},{"$f":"IFERROR(SUMIFS(Таблица1[bb/101],Таблица1[2019],B65)/P65,0)","v":0},{"$f":"IFERROR(SUMIFS(Таблица1[EV bb/101],Таблица1[2019],B65)/P65,0)","v":0},{"$f":"SUMIFS(Таблица1[Net Winnings],Таблица1[2019],B65)","v":0},0]
[null,"12:45 5,5 Progressive KO PAC KO  Regular 9",null,null,{"$f":"IFERROR(IF(VLOOKUP($B66,Таблица1[],9,0)=0,\"\",VLOOKUP($B66,Таблица1[],9,0)),\"\")","v":""},{"$f":"IFERROR(VLOOKUP($B66,Таблица1[],16,0),\"\")","v":""},{"$f":"IFERROR(VLOOKUP($B66,Таблица1[],10,0),\"\")","v":""},{"$f":"IFERROR(VLOOKUP($B66,Таблица1[],11,0),\"\")","v":""},{"$f":"IFERROR(VLOOKUP($B66,Таблица1[],12,0),\"\")","v":""},{"$f":"IFERROR(VLOOKUP($B66,Таблица1[],13,0),\"\")","v":""},{"$f":"IFERROR(VLOOKUP($B66,Таблица1[],14,0),\"\")","v":""},{"$f":"COUNTIFS(Таблица1[2019],B66)+SUMIFS(Таблица1[Re-entry],Таблица1[2019],B66)","v":0},{"$f":"SUMIFS(Таблица1[Total Buy-In],Таблица1[2019],B66)","v":0},0,{"$f":"IFERROR(COUNTIFS(Таблица1[2019],B66,Таблица1[Winnings],\">0\")/L66*100,0)","v":0},{"$f":"SUMIFS(Таблица1[Total Hands],Таблица1[2019],B66)","v":0},{"$f":"IFERROR(SUMIFS(Таблица1[bb/101],Таблица1[2019],B66)/P66,0)","v":0},{"$f":"IFERROR(SUMIFS(Таблица1[EV bb/101],Таблица1[2019],B66)/P66,0)","v":0},{"$f":"SUMIFS(Таблица1[Net Winnings],Таблица1[2019],B66)","v":0},0]
[null,"13:00 1 Hot ES Friz  Turbo 9",null,null,{"$f":"IFERROR(IF(VLOOKUP($B67,Таблица1[],9,0)=0,\"\",VLOOKUP($B67,Таблица1[],9,0)),\"\")","v":""},{"$f":"IFERROR(VLOOKUP($B67,Таблица1[],16,0),\"\")","v":""},{"$f":"IFERROR(VLOOKUP($B67,Таблица1[],10,0),\"\")","v":""},{"$f":"IFERROR(VLOOKUP($B67,Таблица1[],11,0),\"\")","v":""},{"$f":"IFERROR(VLOOKUP($B67,Таблица1[],12,0),\"\")","v":""},{"$f":"IFERROR(VLOOKUP($B67,Таблица1[],13,0),\"\")","v":""},{"$f":"IFERROR(VLOOKUP($B67,Таблица1[],14,0),\"\")","v":""},{"$f":"COUNTIFS(Таблица1[2019],B67)+SUMIFS(Таблица1[Re-entry],Таблица1[2019],B67)","v":0},{"$f":"SUMIFS(Таблица1[Total Buy-In],Таблица1[2019],B67)","v":0},0,{"$f":"IFERROR(COUNTIFS(Таблица1[2019],B67,Таблица1[Winnings],\">0\")/L67*100,0)","v":0},{"$f":"SUMIFS(Таблица1[Total Hands],Таблица1[2019],B67)","v":0},{"$f":"IFERROR(SUMIFS(Таблица1[bb/101],Таблица1[2019],B67)/P67,0)","v":0},{"$f":"IFERROR(SUMIFS(Таблица1[EV bb/101],Таблица1[2019],B67)/P67,0)","v":0},{"$f":"SUMIFS(Таблица1[Net Winnings],Таблица1[2019],B67)","v":0},0]
[null,"13:00 2,2 Gtd PS Friz  Regular 6",null,null,{"$f":"IFERROR(IF(VLOOKUP($B68,Таблица1[],9,0)=0,\"\",VLOOKUP($B68,Таблица1[],9,0)),\"\")","v":""},{"$f":"IFERROR(VLOOKUP($B68,Таблица1[],16,0),\"\")","v":""},{"$f":"IFERROR(VLOOKUP($B68,Таблица1[],10,0),\"\")","v":""},{"$f":"IFERROR(VLOOKUP($B68,Таблица1[],11,0),\"\")","v":""},{"$f":"IFERROR(VLOOKUP($B68,Таблица1[],12,0),\"\")","v":""},{"$f":"IFERROR(VLOOKUP($B68,Таблица1[],13,0),\"\")","v":""},{"$f":"IFERROR(VLOOKUP($B68,Таблица1[],14,0),\"\")","v":""},{"$f":"COUNTIFS(Таблица1[2019],B68)+SUMIFS(Таблица1[Re-entry],Таблица1[2019],B68)","v":0},{"$f":"SUMIFS(Таблица1[Total Buy-In],Таблица1[2019],B68)","v":0},0,{"$f":"IFERROR(COUNTIFS(Таблица1[2019],B68,Таблица1[Winnings],\">0\")/L68*100,0)","v":0},{"$f":"SUMIFS(Таблица1[Total Hands],Таблица1[2019],B68)","v":0},{"$f":"IFERROR(SUMIFS(Таблица1[bb/101],Таблица1[2019],B68)/P68,0)","v":0},{"$f":"IFERROR(SUMIFS(Таблица1[EV bb/101],Таблица1[2019],B68)/P68,0)","v":0},{"$f":"SUMIFS(Таблица1[Net Winnings],Таблица1[2019],B68)","v":0},0]
[null,"13:00 5 Big ES Friz  Regular 9",null,null,{"$f":"IFERROR(IF(VLOOKUP($B69,Таблица1[],9,0)=0,\"\",VLOOKUP($B69,Таблица1[],9,0)),\"\")","v":""},{"$f":"IFERROR(VLOOKUP($B69,Таблица1[],16,0),\"\")","v":""},{"$f":"IFERROR(VLOOKUP($B69,Таблица1[],10,0),\"\")","v":""},{"$f":"IFERROR(VLOOKUP($B69,Таблица1[],11,0),\"\")","v":""},{"$f":"IFERROR(VLOOKUP($B69,Таблица1[],12,0),\"\")","v":""},{"$f":"IFERROR(VLOOKUP($B69,Таблица1[],13,0),\"\")","v":""},{"$f":"IFERROR(VLOOKUP($B69,Таблица1[],14,0),\"\")","v":""},{"$f":"COUNTIFS(Таблица1[2019],B69)+SUMIFS(Таблица1[Re-entry],Таблица1[2019],B69)","v":0},{"$f":"SUMIFS(Таблица1[Total Buy-In],Таблица1[2019],B69)","v":0},0,{"$f":"IFERROR(COUNTIFS(Таблица1[2019],B69,Таблица1[Winnings],\">0\")/L69*100,0)","v":0},{"$f":"SUMIFS(Таблица1[Total Hands],Таблица1[2019],B69)","v":0},{"$f":"IFERROR(SUMIFS(Таблица1[bb/101],Таблица1[2019],B69)/P69,0)","v":0},{"$f":"IFERROR(SUMIFS(Таблица1[EV bb/101],Таблица1[2019],B69)/P69,0)","v":0},{"$f":"SUMIFS(Таблица1[Net Winnings],Таблица1[2019],B69)","v":0},0]
[null,"13:30 4,4 Bounty Builder PS KO  Regular 9",null,null,{"$f":"IFERROR(IF(VLOOKUP($B70,Таблица1[],9,0)=0,\"\",VLOOKUP($B70,Таблица1[],9,0)),\"\")","v":""},{"$f":"IFERROR(VLOOKUP($B70,Таблица1[],16,0),\"\")","v":""},{"$f":"IFERROR(VLOOKUP($B70,Таблица1[],10,0),\"\")","v":""},{"$f":"IFERROR(VLOOKUP($B70,Таблица1[],11,0),\"\")","v":""},{"$f":"IFERROR(VLOOKUP($B70,Таблица1[],12,0),\"\")","v":""},{"$f":"IFERROR(VLOOKUP($B70,Таблица1[],13,0),\"\")","v":""},{"$f":"IFERROR(VLOOKUP($B70,Таблица1[],14,0),\"\")","v":""},{"$f":"COUNTIFS(Таблица1[2019],B70)+SUMIFS(Таблица1[Re-entry],Таблица1[2019],B70)","v":0},{"$f":"SUMIFS(Таблица1[Total Buy-In],Таблица1[2019],B70)","v":0},{"$f":"IFERROR((S70/M70)*100,0)","v":0},{"$f":"IFERROR(COUNTIFS(Таблица1[2019],B70,Таблица1[Winnings],\">0\")/L70*100,0)","v":0},{"$f":"SUMIFS(Таблица1[Total Hands],Таблица1[2019],B70)","v":0},{"$f":"IFERROR(SUMIFS(Таблица1[bb/101],Таблица1[2019],B70)/P70,0)","v":0},{"$f":"IFERROR(SUMIFS(Таблица1[EV bb/101],Таблица1[2019],B70)/P70,0)","v":0},{"$f":"SUMIFS(Таблица1[Net Winnings],Таблица1[2019],B70)","v":0},{"$f":"IFERROR(S70/L70,0)","v":0}]
[null,"13:30 4,4 Progressive KO PAC KO  Regular 9",null,null,{"$f":"IFERROR(IF(VLOOKUP($B71,Таблица1[],9,0)=0,\"\",VLOOKUP($B71,Таблица1[],9,0)),\"\")","v":""},{"$f":"IFERROR(VLOOKUP($B71,Таблица1[],16,0),\"\")","v":""},{"$f":"IFERROR(VLOOKUP($B71,Таблица1[],10,0),\"\")","v":""},{"$f":"IFERROR(VLOOKUP($B71,Таблица1[],11,0),\"\")","v":""},{"$f":"IFERROR(VLOOKUP($B71,Таблица1[],12,0),\"\")","v":""},{"$f":"IFERROR(VLOOKUP($B71,Таблица1[],13,0),\"\")","v":""},{"$f":"IFERROR(VLOOKUP($B71,Таблица1[],14,0),\"\")","v":""},{"$f":"COUNTIFS(Таблица1[2019],B71)+SUMIFS(Таблица1[Re-entry],Таблица1[2019],B71)","v":0},{"$f":"SUMIFS(Таблица1[Total Buy-In],Таблица1[2019],B71)","v":0},0,{"$f":"IFERROR(COUNTIFS(Таблица1[2019],B71,Таблица1[Winnings],\">0\")/L71*100,0)","v":0},{"$f":"SUMIFS(Таблица1[Total Hands],Таблица1[2019],B71)","v":0},{"$f":"IFERROR(SUMIFS(Таблица1[bb/101],Таблица1[2019],B71)/P71,0)","v":0},{"$f":"IFERROR(SUMIFS(Таблица1[EV bb/101],Таблица1[2019],B71)/P71,0)","v":0},{"$f":"SUMIFS(Таблица1[Net Winnings],Таблица1[2019],B71)","v":0},0]
[null,"13:45 2,2 Deep Stacks PS Friz  Regular 9",null,null,{"$f":"IFERROR(IF(VLOOKUP($B72,Таблица1[],9,0)=0,\"\",VLOOKUP($B72,Таблица1[],9,0)),\"\")","v":""},{"$f":"IFERROR(VLOOKUP($B72,Таблица1[],16,0),\"\")","v":""},{"$f":"IFERROR(VLOOKUP($B72,Таблица1[],10,0),\"\")","v":""},{"$f":"IFERROR(VLOOKUP($B72,Таблица1[],11,0),\"\")","v":""},{"$f":"IFERROR(VLOOKUP($B72,Таблица1[],12,0),\"\")","v":""},{"$f":"IFERROR(VLOOKUP($B72,Таблица1[],13,0),\"\")","v":""},{"$f":"IFERROR(VLOOKUP($B72,Таблица1[],14,0),\"\")","v":""},{"$f":"COUNTIFS(Таблица1[2019],B72)+SUMIFS(Таблица1[Re-entry],Таблица1[2019],B72)","v":0},{"$f":"SUMIFS(Таблица1[Total Buy-In],Таблица1[2019],B72)","v":0},0,{"$f":"IFERROR(COUNTIFS(Таблица1[2019],B72,Таблица1[Winnings],\">0\")/L72*100,0)","v":0},{"$f":"SUMIFS(Таблица1[Total Hands],Таблица1[2019],B72)","v":0},{"$f":"IFERROR(SUMIFS(Таблица1[bb/101],Таблица1[2019],B72)/P72,0)","v":0},{"$f":"IFERROR(SUMIFS(Таблица1[EV bb/101],Таблица1[2019],B72)/P72,0)","v":0},{"$f":"SUMIFS(Таблица1[Net Winnings],Таблица1[2019],B72)","v":0},0]
[null,"13:50 2,2 Gtd PS Friz  Turbo 9",null,null,{"$f":"IFERROR(IF(VLOOKUP($B73,Таблица1[],9,0)=0,\"\",VLOOKUP($B73,Таблица1[],9,0)),\"\")","v":""},{"$f":"IFERROR(VLOOKUP($B73,Таблица1[],16,0),\"\")","v":""},{"$f":"IFERROR(VLOOKUP($B73,Таблица1[],10,0),\"\")","v":""},{"$f":"IFERROR(VLOOKUP($B73,Таблица1[],11,0),\"\")","v":""},{"$f":"IFERROR(VLOOKUP($B73,Таблица1[],12,0),\"\")","v":""},{"$f":"IFERROR(VLOOKUP($B73,Таблица1[],13,0),\"\")","v":""},{"$f":"IFERROR(VLOOKUP($B73,Таблица1[],14,0),\"\")","v":""},{"$f":"COUNTIFS(Таблица1[2019],B73)+SUMIFS(Таблица1[Re-entry],Таблица1[2019],B73)","v":0},{"$f":"SUMIFS(Таблица1[Total Buy-In],Таблица1[2019],B73)","v":0},0,{"$f":"IFERROR(COUNTIFS(Таблица1[2019],B73,Таблица1[Winnings],\">0\")/L73*100,0)","v":0},{"$f":"SUMIFS(Таблица1[Total Hands],Таблица1[2019],B73)","v":0},{"$f":"IFERROR(SUMIFS(Таблица1[bb/101],Таблица1[2019],B73)/P73,0)","v":0},{"$f":"IFERROR(SUMIFS(Таблица1[EV bb/101],Таблица1[2019],B73)/P73,0)","v":0},{"$f":"SUMIFS(Таблица1[Net Winnings],Таблица1[2019],B73)","v":0},0]
[null,"14:00 1,1 Satellite PS Friz  Regular 8",null,null,{"$f":"IFERROR(IF(VLOOKUP($B74,Таблица1[],9,0)=0,\"\",VLOOKUP($B74,Таблица1[],9,0)),\"\")","v":""},{"$f":"IFERROR(VLOOKUP($B74,Таблица1[],16,0),\"\")","v":""},{"$f":"IFERROR(VLOOKUP($B74,Таблица1[],10,0),\"\")","v":""},{"$f":"IFERROR(VLOOKUP($B74,Таблица1[],11,0),\"\")","v":""},{"$f":"IFERROR(VLOOKUP($B74,Таблица1[],12,0),\"\")","v":""},{"$f":"IFERROR(VLOOKUP($B74,Таблица1[],13,0),\"\")","v":""},{"$f":"IFERROR(VLOOKUP($B74,Таблица1[],14,0),\"\")","v":""},{"$f":"COUNTIFS(Таблица1[2019],B74)+SUMIFS(Таблица1[Re-entry],Таблица1[2019],B74)","v":0},{"$f":"SUMIFS(Таблица1[Total Buy-In],Таблица1[2019],B74)","v":0},0,{"$f":"IFERROR(COUNTIFS(Таблица1[2019],B74,Таблица1[Winnings],\">0\")/L74*100,0)","v":0},{"$f":"SUMIFS(Таблица1[Total Hands],Таблица1[2019],B74)","v":0},{"$f":"IFERROR(SUMIFS(Таблица1[bb/101],Таблица1[2019],B74)/P74,0)","v":0},{"$f":"IFERROR(SUMIFS(Таблица1[EV bb/101],Таблица1[2019],B74)/P74,0)","v":0},{"$f":"SUMIFS(Таблица1[Net Winnings],Таблица1[2019],B74)","v":0},0]
[null,"14:00 2,2 Gtd PAC Friz  Regular 9",null,null,{"$f":"IFERROR(IF(VLOOKUP($B75,Таблица1[],9,0)=0,\"\",VLOOKUP($B75,Таблица1[],9,0)),\"\")","v":""},{"$f":"IFERROR(VLOOKUP($B75,Таблица1[],16,0),\"\")","v":""},{"$f":"IFERROR(VLOOKUP($B75,Таблица1[],10,0),\"\")","v":""},{"$f":"IFERROR(VLOOKUP($B75,Таблица1[],11,0),\"\")","v":""},{"$f":"IFERROR(VLOOKUP($B75,Таблица1[],12,0),\"\")","v":""},{"$f":"IFERROR(VLOOKUP($B75,Таблица1[],13,0),\"\")","v":""},{"$f":"IFERROR(VLOOKUP($B75,Таблица1[],14,0),\"\")","v":""},{"$f":"COUNTIFS(Таблица1[2019],B75)+SUMIFS(Таблица1[Re-entry],Таблица1[2019],B75)","v":0},{"$f":"SUMIFS(Таблица1[Total Buy-In],Таблица1[2019],B75)","v":0},0,{"$f":"IFERROR(COUNTIFS(Таблица1[2019],B75,Таблица1[Winnings],\">0\")/L75*100,0)","v":0},{"$f":"SUMIFS(Таблица1[Total Hands],Таблица1[2019],B75)","v":0},{"$f":"IFERROR(SUMIFS(Таблица1[bb/101],Таблица1[2019],B75)/P75,0)","v":0},{"$f":"IFERROR(SUMIFS(Таблица1[EV bb/101],Таблица1[2019],B75)/P75,0)","v":0},{"$f":"SUMIFS(Таблица1[Net Winnings],Таблица1[2019],B75)","v":0},0]
[null,"14:05 4,4 Gtd PS Friz  Regular 8",null,null,{"$f":"IFERROR(IF(VLOOKUP($B76,Таблица1[],9,0)=0,\"\",VLOOKUP($B76,Таблица1[],9,0)),\"\")","v":""},{"$f":"IFERROR(VLOOKUP($B76,Таблица1[],16,0),\"\")","v":""},{"$f":"IFERROR(VLOOKUP($B76,Таблица1[],10,0),\"\")","v":""},{"$f":"IFERROR(VLOOKUP($B76,Таблица1[],11,0),\"\")","v":""},{"$f":"IFERROR(VLOOKUP($B76,Таблица1[],12,0),\"\")","v":""},{"$f":"IFERROR(VLOOKUP($B76,Таблица1[],13,0),\"\")","v":""},{"$f":"IFERROR(VLOOKUP($B76,Таблица1[],14,0),\"\")","v":""},{"$f":"COUNTIFS(Таблица1[2019],B76)+SUMIFS(Таблица1[Re-entry],Таблица1[2019],B76)","v":0},{"$f":"SUMIFS(Таблица1[Total Buy-In],Таблица1[2019],B76)","v":0},0,{"$f":"IFERROR(COUNTIFS(Таблица1[2019],B76,Таблица1[Winnings],\">0\")/L76*100,0)","v":0},{"$f":"SUMIFS(Таблица1[Total Hands],Таблица1[2019],B76)","v":0},{"$f":"IFERROR(SUMIFS(Таблица1[bb/101],Таблица1[2019],B76)/P76,0)","v":0},{"$f":"IFERROR(SUMIFS(Таблица1[EV bb/101],Таблица1[2019],B76)/P76,0)","v":0},{"$f":"SUMIFS(Таблица1[Net Winnings],Таблица1[2019],B76)","v":0},0]
[null,"14:10 5,5 Win the Button PS Friz  Regular 9",null,null,{"$f":"IFERROR(IF(VLOOKUP($B77,Таблица1[],9,0)=0,\"\",VLOOKUP($B77,Таблица1[],9,0)),\"\")","v":""},{"$f":"IFERROR(VLOOKUP($B77,Таблица1[],16,0),\"\")","v":""},{"$f":"IFERROR(VLOOKUP($B77,Таблица1[],10,0),\"\")","v":""},{"$f":"IFERROR(VLOOKUP($B77,Таблица1[],11,0),\"\")","v":""},{"$f":"IFERROR(VLOOKUP($B77,Таблица1[],12,0),\"\")","v":""},{"$f":"IFERROR(VLOOKUP($B77,Таблица1[],13,0),\"\")","v":""},{"$f":"IFERROR(VLOOKUP($B77,Таблица1[],14,0),\"\")","v":""},{"$f":"COUNTIFS(Таблица1[2019],B77)+SUMIFS(Таблица1[Re-entry],Таблица1[2019],B77)","v":0},{"$f":"SUMIFS(Таблица1[Total Buy-In],Таблица1[2019],B77)","v":0},0,{"$f":"IFERROR(COUNTIFS(Таблица1[2019],B77,Таблица1[Winnings],\">0\")/L77*100,0)","v":0},{"$f":"SUMIFS(Таблица1[Total Hands],Таблица1[2019],B77)","v":0},{"$f":"IFERROR(SUMIFS(Таблица1[bb/101],Таблица1[2019],B77)/P77,0)","v":0},{"$f":"IFERROR(SUMIFS(Таблица1[EV bb/101],Таблица1[2019],B77)/P77,0)","v":0},{"$f":"SUMIFS(Таблица1[Net Winnings],Таблица1[2019],B77)","v":0},0]
[null,"14:20 1,1 Progressive KO PS KO  Regular 9",null,null,{"$f":"IFERROR(IF(VLOOKUP($B78,Таблица1[],9,0)=0,\"\",VLOOKUP($B78,Таблица1[],9,0)),\"\")","v":""},{"$f":"IFERROR(VLOOKUP($B78,Таблица1[],16,0),\"\")","v":""},{"$f":"IFERROR(VLOOKUP($B78,Таблица1[],10,0),\"\")","v":""},{"$f":"IFERROR(VLOOKUP($B78,Таблица1[],11,0),\"\")","v":""},{"$f":"IFERROR(VLOOKUP($B78,Таблица1[],12,0),\"\")","v":""},{"$f":"IFERROR(VLOOKUP($B78,Таблица1[],13,0),\"\")","v":""},{"$f":"IFERROR(VLOOKUP($B78,Таблица1[],14,0),\"\")","v":""},{"$f":"COUNTIFS(Таблица1[2019],B78)+SUMIFS(Таблица1[Re-entry],Таблица1[2019],B78)","v":0},{"$f":"SUMIFS(Таблица1[Total Buy-In],Таблица1[2019],B78)","v":0},0,{"$f":"IFERROR(COUNTIFS(Таблица1[2019],B78,Таблица1[Winnings],\">0\")/L78*100,0)","v":0},{"$f":"SUMIFS(Таблица1[Total Hands],Таблица1[2019],B78)","v":0},{"$f":"IFERROR(SUMIFS(Таблица1[bb/101],Таблица1[2019],B78)/P78,0)","v":0},{"$f":"IFERROR(SUMIFS(Таблица1[EV bb/101],Таблица1[2019],B78)/P78,0)","v":0},{"$f":"SUMIFS(Таблица1[Net Winnings],Таблица1[2019],B78)","v":0},0]
[null,"14:30 1,1 Splash R/a PS Friz  Turbo 9",null,null,{"$f":"IFERROR(IF(VLOOKUP($B79,Таблица1[],9,0)=0,\"\",VLOOKUP($B79,Таблица1[],9,0)),\"\")","v":""},{"$f":"IFERROR(VLOOKUP($B79,Таблица1[],16,0),\"\")","v":""},{"$f":"IFERROR(VLOOKUP($B79,Таблица1[],10,0),\"\")","v":""},{"$f":"IFERROR(VLOOKUP($B79,Таблица1[],11,0),\"\")","v":""},{"$f":"IFERROR(VLOOKUP($B79,Таблица1[],12,0),\"\")","v":""},{"$f":"IFERROR(VLOOKUP($B79,Таблица1[],13,0),\"\")","v":""},{"$f":"IFERROR(VLOOKUP($B79,Таблица1[],14,0),\"\")","v":""},{"$f":"COUNTIFS(Таблица1[2019],B79)+SUMIFS(Таблица1[Re-entry],Таблица1[2019],B79)","v":0},{"$f":"SUMIFS(Таблица1[Total Buy-In],Таблица1[2019],B79)","v":0},{"$f":"IFERROR((S79/M79)*100,0)","v":0},{"$f":"IFERROR(COUNTIFS(Таблица1[2019],B79,Таблица1[Winnings],\">0\")/L79*100,0)","v":0},{"$f":"SUMIFS(Таблица1[Total Hands],Таблица1[2019],B79)","v":0},{"$f":"IFERROR(SUMIFS(Таблица1[bb/101],Таблица1[2019],B79)/P79,0)","v":0},{"$f":"IFERROR(SUMIFS(Таблица1[EV bb/101],Таблица1[2019],B79)/P79,0)","v":0},{"$f":"SUMIFS(Таблица1[Net Winnings],Таблица1[2019],B79)","v":0},{"$f":"IFERROR(S79/L79,0)","v":0}]
[null,"14:30 3,3 Gtd PAC Friz  Regular 9",null,null,{"$f":"IFERROR(IF(VLOOKUP($B80,Таблица1[],9,0)=0,\"\",VLOOKUP($B80,Таблица1[],9,0)),\"\")","v":""},{"$f":"IFERROR(VLOOKUP($B80,Таблица1[],16,0),\"\")","v":""},{"$f":"IFERROR(VLOOKUP($B80,Таблица1[],10,0),\"\")","v":""},{"$f":"IFERROR(VLOOKUP($B80,Таблица1[],11,0),\"\")","v":""},{"$f":"IFERROR(VLOOKUP($B80,Таблица1[],12,0),\"\")","v":""},{"$f":"IFERROR(VLOOKUP($B80,Таблица1[],13,0),\"\")","v":""},{"$f":"IFERROR(VLOOKUP($B80,Таблица1[],14,0),\"\")","v":""},{"$f":"COUNTIFS(Таблица1[2019],B80)+SUMIFS(Таблица1[Re-entry],Таблица1[2019],B80)","v":0},{"$f":"SUMIFS(Таблица1[Total Buy-In],Таблица1[2019],B80)","v":0},0,{"$f":"IFERROR(COUNTIFS(Таблица1[2019],B80,Таблица1[Winnings],\">0\")/L80*100,0)","v":0},{"$f":"SUMIFS(Таблица1[Total Hands],Таблица1[2019],B80)","v":0},{"$f":"IFERROR(SUMIFS(Таблица1[bb/101],Таблица1[2019],B80)/P80,0)","v":0},{"$f":"IFERROR(SUMIFS(Таблица1[EV bb/101],Таблица1[2019],B80)/P80,0)","v":0},{"$f":"SUMIFS(Таблица1[Net Winnings],Таблица1[2019],B80)","v":0},0]
[null,"14:45 2,2 Gtd PS Friz  Regular 6",null,null,{"$f":"IFERROR(IF(VLOOKUP($B81,Таблица1[],9,0)=0,\"\",VLOOKUP($B81,Таблица1[],9,0)),\"\")","v":""},{"$f":"IFERROR(VLOOKUP($B81,Таблица1[],16,0),\"\")","v":""},{"$f":"IFERROR(VLOOKUP($B81,Таблица1[],10,0),\"\")","v":""},{"$f":"IFERROR(VLOOKUP($B81,Таблица1[],11,0),\"\")","v":""},{"$f":"IFERROR(VLOOKUP($B81,Таблица1[],12,0),\"\")","v":""},{"$f":"IFERROR(VLOOKUP($B81,Таблица1[],13,0),\"\")","v":""},{"$f":"IFERROR(VLOOKUP($B81,Таблица1[],14,0),\"\")","v":""},{"$f":"COUNTIFS(Таблица1[2019],B81)+SUMIFS(Таблица1[Re-entry],Таблица1[2019],B81)","v":0},{"$f":"SUMIFS(Таблица1[Total Buy-In],Таблица1[2019],B81)","v":0},0,{"$f":"IFERROR(COUNTIFS(Таблица1[2019],B81,Таблица1[Winnings],\">0\")/L81*100,0)","v":0},{"$f":"SUMIFS(Таблица1[Total Hands],Таблица1[2019],B81)","v":0},{"$f":"IFERROR(SUMIFS(Таблица1[bb/101],Таблица1[2019],B81)/P81,0)","v":0},{"$f":"IFERROR(SUMIFS(Таблица1[EV bb/101],Таблица1[2019],B81)/P81,0)","v":0},{"$f":"SUMIFS(Таблица1[Net Winnings],Таблица1[2019],B81)","v":0},0]
[null,"15:00 1,1 Gtd PS Friz  Regular 9",null,null,{"$f":"IFERROR(IF(VLOOKUP($B82,Таблица1[],9,0)=0,\"\",VLOOKUP($B82,Таблица1[],9,0)),\"\")","v":""},{"$f":"IFERROR(VLOOKUP($B82,Таблица1[],16,0),\"\")","v":""},{"$f":"IFERROR(VLOOKUP($B82,Таблица1[],10,0),\"\")","v":""},{"$f":"IFERROR(VLOOKUP($B82,Таблица1[],11,0),\"\")","v":""},{"$f":"IFERROR(VLOOKUP($B82,Таблица1[],12,0),\"\")","v":""},{"$f":"IFERROR(VLOOKUP($B82,Таблица1[],13,0),\"\")","v":""},{"$f":"IFERROR(VLOOKUP($B82,Таблица1[],14,0),\"\")","v":""},{"$f":"COUNTIFS(Таблица1[2019],B82)+SUMIFS(Таблица1[Re-entry],Таблица1[2019],B82)","v":0},{"$f":"SUMIFS(Таблица1[Total Buy-In],Таблица1[2019],B82)","v":0},0,{"$f":"IFERROR(COUNTIFS(Таблица1[2019],B82,Таблица1[Winnings],\">0\")/L82*100,0)","v":0},{"$f":"SUMIFS(Таблица1[Total Hands],Таблица1[2019],B82)","v":0},{"$f":"IFERROR(SUMIFS(Таблица1[bb/101],Таблица1[2019],B82)/P82,0)","v":0},{"$f":"IFERROR(SUMIFS(Таблица1[EV bb/101],Таблица1[2019],B82)/P82,0)","v":0},{"$f":"SUMIFS(Таблица1[Net Winnings],Таблица1[2019],B82)","v":0},0]
[null,"15:00 3,3 Saturday Micro PS Friz  Regular 9",null,null,{"$f":"IFERROR(IF(VLOOKUP($B83,Таблица1[],9,0)=0,\"\",VLOOKUP($B83,Таблица1[],9,0)),\"\")","v":""},{"$f":"IFERROR(VLOOKUP($B83,Таблица1[],16,0),\"\")","v":""},{"$f":"IFERROR(VLOOKUP($B83,Таблица1[],10,0),\"\")","v":""},{"$f":"IFERROR(VLOOKUP($B83,Таблица1[],11,0),\"\")","v":""},{"$f":"IFERROR(VLOOKUP($B83,Таблица1[],12,0),\"\")","v":""},{"$f":"IFERROR(VLOOKUP($B83,Таблица1[],13,0),\"\")","v":""},{"$f":"IFERROR(VLOOKUP($B83,Таблица1[],14,0),\"\")","v":""},{"$f":"COUNTIFS(Таблица1[2019],B83)+SUMIFS(Таблица1[Re-entry],Таблица1[2019],B83)","v":0},{"$f":"SUMIFS(Таблица1[Total Buy-In],Таблица1[2019],B83)","v":0},0,{"$f":"IFERROR(COUNTIFS(Таблица1[2019],B83,Таблица1[Winnings],\">0\")/L83*100,0)","v":0},{"$f":"SUMIFS(Таблица1[Total Hands],Таблица1[2019],B83)","v":0},{"$f":"IFERROR(SUMIFS(Таблица1[bb/101],Таблица1[2019],B83)/P83,0)","v":0},{"$f":"IFERROR(SUMIFS(Таблица1[EV bb/101],Таблица1[2019],B83)/P83,0)","v":0},{"$f":"SUMIFS(Таблица1[Net Winnings],Таблица1[2019],B83)","v":0},0]
[null,"15:15 3 SuperStack ES Friz  Regular 6",null,null,{"$f":"IFERROR(IF(VLOOKUP($B84,Таблица1[],9,0)=0,\"\",VLOOKUP($B84,Таблица1[],9,0)),\"\")","v":""},{"$f":"IFERROR(VLOOKUP($B84,Таблица1[],16,0),\"\")","v":""},{"$f":"IFERROR(VLOOKUP($B84,Таблица1[],10,0),\"\")","v":""},{"$f":"IFERROR(VLOOKUP($B84,Таблица1[],11,0),\"\")","v":""},{"$f":"IFERROR(VLOOKUP($B84,Таблица1[],12,0),\"\")","v":""},{"$f":"IFERROR(VLOOKUP($B84,Таблица1[],13,0),\"\")","v":""},{"$f":"IFERROR(VLOOKUP($B84,Таблица1[],14,0),\"\")","v":""},{"$f":"COUNTIFS(Таблица1[2019],B84)+SUMIFS(Таблица1[Re-entry],Таблица1[2019],B84)","v":0},{"$f":"SUMIFS(Таблица1[Total Buy-In],Таблица1[2019],B84)","v":0},0,{"$f":"IFERROR(COUNTIFS(Таблица1[2019],B84,Таблица1[Winnings],\">0\")/L84*100,0)","v":0},{"$f":"SUMIFS(Таблица1[Total Hands],Таблица1[2019],B84)","v":0},{"$f":"IFERROR(SUMIFS(Таблица1[bb/101],Таблица1[2019],B84)/P84,0)","v":0},{"$f":"IFERROR(SUMIFS(Таблица1[EV bb/101],Таблица1[2019],B84)/P84,0)","v":0},{"$f":"SUMIFS(Таблица1[Net Winnings],Таблица1[2019],B84)","v":0},0]
[null,"15:30 1 Storm R/A ES Friz  Regular 9",null,null,{"$f":"IFERROR(IF(VLOOKUP($B85,Таблица1[],9,0)=0,\"\",VLOOKUP($B85,Таблица1[],9,0)),\"\")","v":""},{"$f":"IFERROR(VLOOKUP($B85,Таблица1[],16,0),\"\")","v":""},{"$f":"IFERROR(VLOOKUP($B85,Таблица1[],10,0),\"\")","v":""},{"$f":"IFERROR(VLOOKUP($B85,Таблица1[],11,0),\"\")","v":""},{"$f":"IFERROR(VLOOKUP($B85,Таблица1[],12,0),\"\")","v":""},{"$f":"IFERROR(VLOOKUP($B85,Таблица1[],13,0),\"\")","v":""},{"$f":"IFERROR(VLOOKUP($B85,Таблица1[],14,0),\"\")","v":""},{"$f":"COUNTIFS(Таблица1[2019],B85)+SUMIFS(Таблица1[Re-entry],Таблица1[2019],B85)","v":0},{"$f":"SUMIFS(Таблица1[Total Buy-In],Таблица1[2019],B85)","v":0},0,{"$f":"IFERROR(COUNTIFS(Таблица1[2019],B85,Таблица1[Winnings],\">0\")/L85*100,0)","v":0},{"$f":"SUMIFS(Таблица1[Total Hands],Таблица1[2019],B85)","v":0},{"$f":"IFERROR(SUMIFS(Таблица1[bb/101],Таблица1[2019],B85)/P85,0)","v":0},{"$f":"IFERROR(SUMIFS(Таблица1[EV bb/101],Таблица1[2019],B85)/P85,0)","v":0},{"$f":"SUMIFS(Таблица1[Net Winnings],Таблица1[2019],B85)","v":0},0]
[null,"15:40 3,3 Deep Payouts PS Friz  Turbo 9",null,null,{"$f":"IFERROR(IF(VLOOKUP($B86,Таблица1[],9,0)=0,\"\",VLOOKUP($B86,Таблица1[],9,0)),\"\")","v":""},{"$f":"IFERROR(VLOOKUP($B86,Таблица1[],16,0),\"\")","v":""},{"$f":"IFERROR(VLOOKUP($B86,Таблица1[],10,0),\"\")","v":""},{"$f":"IFERROR(VLOOKUP($B86,Таблица1[],11,0),\"\")","v":""},{"$f":"IFERROR(VLOOKUP($B86,Таблица1[],12,0),\"\")","v":""},{"$f":"IFERROR(VLOOKUP($B86,Таблица1[],13,0),\"\")","v":""},{"$f":"IFERROR(VLOOKUP($B86,Таблица1[],14,0),\"\")","v":""},{"$f":"COUNTIFS(Таблица1[2019],B86)+SUMIFS(Таблица1[Re-entry],Таблица1[2019],B86)","v":0},{"$f":"SUMIFS(Таблица1[Total Buy-In],Таблица1[2019],B86)","v":0},0,{"$f":"IFERROR(COUNTIFS(Таблица1[2019],B86,Таблица1[Winnings],\">0\")/L86*100,0)","v":0},{"$f":"SUMIFS(Таблица1[Total Hands],Таблица1[2019],B86)","v":0},{"$f":"IFERROR(SUMIFS(Таблица1[bb/101],Таблица1[2019],B86)/P86,0)","v":0},{"$f":"IFERROR(SUMIFS(Таблица1[EV bb/101],Таблица1[2019],B86)/P86,0)","v":0},{"$f":"SUMIFS(Таблица1[Net Winnings],Таблица1[2019],B86)","v":0},0]
[null,"16:00 4,4 Big PS Friz  Regular 9",null,null,{"$f":"IFERROR(IF(VLOOKUP($B87,Таблица1[],9,0)=0,\"\",VLOOKUP($B87,Таблица1[],9,0)),\"\")","v":""},{"$f":"IFERROR(VLOOKUP($B87,Таблица1[],16,0),\"\")","v":""},{"$f":"IFERROR(VLOOKUP($B87,Таблица1[],10,0),\"\")","v":""},{"$f":"IFERROR(VLOOKUP($B87,Таблица1[],11,0),\"\")","v":""},{"$f":"IFERROR(VLOOKUP($B87,Таблица1[],12,0),\"\")","v":""},{"$f":"IFERROR(VLOOKUP($B87,Таблица1[],13,0),\"\")","v":""},{"$f":"IFERROR(VLOOKUP($B87,Таблица1[],14,0),\"\")","v":""},{"$f":"COUNTIFS(Таблица1[2019],B87)+SUMIFS(Таблица1[Re-entry],Таблица1[2019],B87)","v":0},{"$f":"SUMIFS(Таблица1[Total Buy-In],Таблица1[2019],B87)","v":0},0,{"$f":"IFERROR(COUNTIFS(Таблица1[2019],B87,Таблица1[Winnings],\">0\")/L87*100,0)","v":0},{"$f":"SUMIFS(Таблица1[Total Hands],Таблица1[2019],B87)","v":0},{"$f":"IFERROR(SUMIFS(Таблица1[bb/101],Таблица1[2019],B87)/P87,0)","v":0},{"$f":"IFERROR(SUMIFS(Таблица1[EV bb/101],Таблица1[2019],B87)/P87,0)","v":0},{"$f":"SUMIFS(Таблица1[Net Winnings],Таблица1[2019],B87)","v":0},0]
[null,"16:15 1,1 Gtd PS Friz  Regular 9",null,null,{"$f":"IFERROR(IF(VLOOKUP($B88,Таблица1[],9,0)=0,\"\",VLOOKUP($B88,Таблица1[],9,0)),\"\")","v":""},{"$f":"IFERROR(VLOOKUP($B88,Таблица1[],16,0),\"\")","v":""},{"$f":"IFERROR(VLOOKUP($B88,Таблица1[],10,0),\"\")","v":""},{"$f":"IFERROR(VLOOKUP($B88,Таблица1[],11,0),\"\")","v":""},{"$f":"IFERROR(VLOOKUP($B88,Таблица1[],12,0),\"\")","v":""},{"$f":"IFERROR(VLOOKUP($B88,Таблица1[],13,0),\"\")","v":""},{"$f":"IFERROR(VLOOKUP($B88,Таблица1[],14,0),\"\")","v":""},{"$f":"COUNTIFS(Таблица1[2019],B88)+SUMIFS(Таблица1[Re-entry],Таблица1[2019],B88)","v":0},{"$f":"SUMIFS(Таблица1[Total Buy-In],Таблица1[2019],B88)","v":0},0,{"$f":"IFERROR(COUNTIFS(Таблица1[2019],B88,Таблица1[Winnings],\">0\")/L88*100,0)","v":0},{"$f":"SUMIFS(Таблица1[Total Hands],Таблица1[2019],B88)","v":0},{"$f":"IFERROR(SUMIFS(Таблица1[bb/101],Таблица1[2019],B88)/P88,0)","v":0},{"$f":"IFERROR(SUMIFS(Таблица1[EV bb/101],Таблица1[2019],B88)/P88,0)","v":0},{"$f":"SUMIFS(Таблица1[Net Winnings],Таблица1[2019],B88)","v":0},0]
[null,"16:20 5,5 Progressive KO PS KO  Regular 6",null,null,{"$f":"IFERROR(IF(VLOOKUP($B89,Таблица1[],9,0)=0,\"\",VLOOKUP($B89,Таблица1[],9,0)),\"\")","v":""},{"$f":"IFERROR(VLOOKUP($B89,Таблица1[],16,0),\"\")","v":""},{"$f":"IFERROR(VLOOKUP($B89,Таблица1[],10,0),\"\")","v":""},{"$f":"IFERROR(VLOOKUP($B89,Таблица1[],11,0),\"\")","v":""},{"$f":"IFERROR(VLOOKUP($B89,Таблица1[],12,0),\"\")","v":""},{"$f":"IFERROR(VLOOKUP($B89,Таблица1[],13,0),\"\")","v":""},{"$f":"IFERROR(VLOOKUP($B89,Таблица1[],14,0),\"\")","v":""},{"$f":"COUNTIFS(Таблица1[2019],B89)+SUMIFS(Таблица1[Re-entry],Таблица1[2019],B89)","v":0},{"$f":"SUMIFS(Таблица1[Total Buy-In],Таблица1[2019],B89)","v":0},0,{"$f":"IFERROR(COUNTIFS(Таблица1[2019],B89,Таблица1[Winnings],\">0\")/L89*100,0)","v":0},{"$f":"SUMIFS(Таблица1[Total Hands],Таблица1[2019],B89)","v":0},{"$f":"IFERROR(SUMIFS(Таблица1[bb/101],Таблица1[2019],B89)/P89,0)","v":0},{"$f":"IFERROR(SUMIFS(Таблица1[EV bb/101],Таблица1[2019],B89)/P89,0)","v":0},{"$f":"SUMIFS(Таблица1[Net Winnings],Таблица1[2019],B89)","v":0},0]
[null,"16:25 2,2 Player Cap PS Friz  Regular 9",null,null,{"$f":"IFERROR(IF(VLOOKUP($B90,Таблица1[],9,0)=0,\"\",VLOOKUP($B90,Таблица1[],9,0)),\"\")","v":""},{"$f":"IFERROR(VLOOKUP($B90,Таблица1[],16,0),\"\")","v":""},{"$f":"IFERROR(VLOOKUP($B90,Таблица1[],10,0),\"\")","v":""},{"$f":"IFERROR(VLOOKUP($B90,Таблица1[],11,0),\"\")","v":""},{"$f":"IFERROR(VLOOKUP($B90,Таблица1[],12,0),\"\")","v":""},{"$f":"IFERROR(VLOOKUP($B90,Таблица1[],13,0),\"\")","v":""},{"$f":"IFERROR(VLOOKUP($B90,Таблица1[],14,0),\"\")","v":""},{"$f":"COUNTIFS(Таблица1[2019],B90)+SUMIFS(Таблица1[Re-entry],Таблица1[2019],B90)","v":0},{"$f":"SUMIFS(Таблица1[Total Buy-In],Таблица1[2019],B90)","v":0},0,{"$f":"IFERROR(COUNTIFS(Таблица1[2019],B90,Таблица1[Winnings],\">0\")/L90*100,0)","v":0},{"$f":"SUMIFS(Таблица1[Total Hands],Таблица1[2019],B90)","v":0},{"$f":"IFERROR(SUMIFS(Таблица1[bb/101],Таблица1[2019],B90)/P90,0)","v":0},{"$f":"IFERROR(SUMIFS(Таблица1[EV bb/101],Таблица1[2019],B90)/P90,0)","v":0},{"$f":"SUMIFS(Таблица1[Net Winnings],Таблица1[2019],B90)","v":0},0]
[null,"16:30 1,1 MicroMillions PS KO  Turbo 6",null,null,{"$f":"IFERROR(IF(VLOOKUP($B91,Таблица1[],9,0)=0,\"\",VLOOKUP($B91,Таблица1[],9,0)),\"\")","v":""},{"$f":"IFERROR(VLOOKUP($B91,Таблица1[],16,0),\"\")","v":""},{"$f":"IFERROR(VLOOKUP($B91,Таблица1[],10,0),\"\")","v":""},{"$f":"IFERROR(VLOOKUP($B91,Таблица1[],11,0),\"\")","v":""},{"$f":"IFERROR(VLOOKUP($B91,Таблица1[],12,0),\"\")","v":""},{"$f":"IFERROR(VLOOKUP($B91,Таблица1[],13,0),\"\")","v":""},{"$f":"IFERROR(VLOOKUP($B91,Таблица1[],14,0),\"\")","v":""},{"$f":"COUNTIFS(Таблица1[2019],B91)+SUMIFS(Таблица1[Re-entry],Таблица1[2019],B91)","v":0},{"$f":"SUMIFS(Таблица1[Total Buy-In],Таблица1[2019],B91)","v":0},0,{"$f":"IFERROR(COUNTIFS(Таблица1[2019],B91,Таблица1[Winnings],\">0\")/L91*100,0)","v":0},{"$f":"SUMIFS(Таблица1[Total Hands],Таблица1[2019],B91)","v":0},{"$f":"IFERROR(SUMIFS(Таблица1[bb/101],Таблица1[2019],B91)/P91,0)","v":0},{"$f":"IFERROR(SUMIFS(Таблица1[EV bb/101],Таблица1[2019],B91)/P91,0)","v":0},{"$f":"SUMIFS(Таблица1[Net Winnings],Таблица1[2019],B91)","v":0},0]
[null,"16:30 2,2 Gtd PAC Friz  Regular 9",null,null,{"$f":"IFERROR(IF(VLOOKUP($B92,Таблица1[],9,0)=0,\"\",VLOOKUP($B92,Таблица1[],9,0)),\"\")","v":""},{"$f":"IFERROR(VLOOKUP($B92,Таблица1[],16,0),\"\")","v":""},{"$f":"IFERROR(VLOOKUP($B92,Таблица1[],10,0),\"\")","v":""},{"$f":"IFERROR(VLOOKUP($B92,Таблица1[],11,0),\"\")","v":""},{"$f":"IFERROR(VLOOKUP($B92,Таблица1[],12,0),\"\")","v":""},{"$f":"IFERROR(VLOOKUP($B92,Таблица1[],13,0),\"\")","v":""},{"$f":"IFERROR(VLOOKUP($B92,Таблица1[],14,0),\"\")","v":""},{"$f":"COUNTIFS(Таблица1[2019],B92)+SUMIFS(Таблица1[Re-entry],Таблица1[2019],B92)","v":0},{"$f":"SUMIFS(Таблица1[Total Buy-In],Таблица1[2019],B92)","v":0},{"$f":"IFERROR((S92/M92)*100,0)","v":0},{"$f":"IFERROR(COUNTIFS(Таблица1[2019],B92,Таблица1[Winnings],\">0\")/L92*100,0)","v":0},{"$f":"SUMIFS(Таблица1[Total Hands],Таблица1[2019],B92)","v":0},{"$f":"IFERROR(SUMIFS(Таблица1[bb/101],Таблица1[2019],B92)/P92,0)","v":0},{"$f":"IFERROR(SUMIFS(Таблица1[EV bb/101],Таблица1[2019],B92)/P92,0)","v":0},{"$f":"SUMIFS(Таблица1[Net Winnings],Таблица1[2019],B92)","v":0},{"$f":"IFERROR(S92/L92,0)","v":0}]
[null,"16:30 5 6-Max Club ES Friz  Regular 6",null,null,{"$f":"IFERROR(IF(VLOOKUP($B93,Таблица1[],9,0)=0,\"\",VLOOKUP($B93,Таблица1[],9,0)),\"\")","v":""},{"$f":"IFERROR(VLOOKUP($B93,Таблица1[],16,0),\"\")","v":""},{"$f":"IFERROR(VLOOKUP($B93,Таблица1[],10,0),\"\")","v":""},{"$f":"IFERROR(VLOOKUP($B93,Таблица1[],11,0),\"\")","v":""},{"$f":"IFERROR(VLOOKUP($B93,Таблица1[],12,0),\"\")","v":""},{"$f":"IFERROR(VLOOKUP($B93,Таблица1[],13,0),\"\")","v":""},{"$f":"IFERROR(VLOOKUP($B93,Таблица1[],14,0),\"\")","v":""},{"$f":"COUNTIFS(Таблица1[2019],B93)+SUMIFS(Таблица1[Re-entry],Таблица1[2019],B93)","v":0},{"$f":"SUMIFS(Таблица1[Total Buy-In],Таблица1[2019],B93)","v":0},0,{"$f":"IFERROR(COUNTIFS(Таблица1[2019],B93,Таблица1[Winnings],\">0\")/L93*100,0)","v":0},{"$f":"SUMIFS(Таблица1[Total Hands],Таблица1[2019],B93)","v":0},{"$f":"IFERROR(SUMIFS(Таблица1[bb/101],Таблица1[2019],B93)/P93,0)","v":0},{"$f":"IFERROR(SUMIFS(Таблица1[EV bb/101],Таблица1[2019],B93)/P93,0)","v":0},{"$f":"SUMIFS(Таблица1[Net Winnings],Таблица1[2019],B93)","v":0},0]
[null,"16:30 5,5 MicroMillions PS KO  Regular 9",null,null,{"$f":"IFERROR(IF(VLOOKUP($B94,Таблица1[],9,0)=0,\"\",VLOOKUP($B94,Таблица1[],9,0)),\"\")","v":""},{"$f":"IFERROR(VLOOKUP($B94,Таблица1[],16,0),\"\")","v":""},{"$f":"IFERROR(VLOOKUP($B94,Таблица1[],10,0),\"\")","v":""},{"$f":"IFERROR(VLOOKUP($B94,Таблица1[],11,0),\"\")","v":""},{"$f":"IFERROR(VLOOKUP($B94,Таблица1[],12,0),\"\")","v":""},{"$f":"IFERROR(VLOOKUP($B94,Таблица1[],13,0),\"\")","v":""},{"$f":"IFERROR(VLOOKUP($B94,Таблица1[],14,0),\"\")","v":""},{"$f":"COUNTIFS(Таблица1[2019],B94)+SUMIFS(Таблица1[Re-entry],Таблица1[2019],B94)","v":0},{"$f":"SUMIFS(Таблица1[Total Buy-In],Таблица1[2019],B94)","v":0},0,{"$f":"IFERROR(COUNTIFS(Таблица1[2019],B94,Таблица1[Winnings],\">0\")/L94*100,0)","v":0},{"$f":"SUMIFS(Таблица1[Total Hands],Таблица1[2019],B94)","v":0},{"$f":"IFERROR(SUMIFS(Таблица1[bb/101],Таблица1[2019],B94)/P94,0)","v":0},{"$f":"IFERROR(SUMIFS(Таблица1[EV bb/101],Таблица1[2019],B94)/P94,0)","v":0},{"$f":"SUMIFS(Таблица1[Net Winnings],Таблица1[2019],B94)","v":0},0]
[null,"16:30 5,5 Mini Daily Marathon PS Friz  Regular 9",null,null,{"$f":"IFERROR(IF(VLOOKUP($B95,Таблица1[],9,0)=0,\"\",VLOOKUP($B95,Таблица1[],9,0)),\"\")","v":""},{"$f":"IFERROR(VLOOKUP($B95,Таблица1[],16,0),\"\")","v":""},{"$f":"IFERROR(VLOOKUP($B95,Таблица1[],10,0),\"\")","v":""},{"$f":"IFERROR(VLOOKUP($B95,Таблица1[],11,0),\"\")","v":""},{"$f":"IFERROR(VLOOKUP($B95,Таблица1[],12,0),\"\")","v":""},{"$f":"IFERROR(VLOOKUP($B95,Таблица1[],13,0),\"\")","v":""},{"$f":"IFERROR(VLOOKUP($B95,Таблица1[],14,0),\"\")","v":""},{"$f":"COUNTIFS(Таблица1[2019],B95)+SUMIFS(Таблица1[Re-entry],Таблица1[2019],B95)","v":0},{"$f":"SUMIFS(Таблица1[Total Buy-In],Таблица1[2019],B95)","v":0},{"$f":"IFERROR((S95/M95)*100,0)","v":0},{"$f":"IFERROR(COUNTIFS(Таблица1[2019],B95,Таблица1[Winnings],\">0\")/L95*100,0)","v":0},{"$f":"SUMIFS(Таблица1[Total Hands],Таблица1[2019],B95)","v":0},{"$f":"IFERROR(SUMIFS(Таблица1[bb/101],Таблица1[2019],B95)/P95,0)","v":0},{"$f":"IFERROR(SUMIFS(Таблица1[EV bb/101],Таблица1[2019],B95)/P95,0)","v":0},{"$f":"SUMIFS(Таблица1[Net Winnings],Таблица1[2019],B95)","v":0},{"$f":"IFERROR(S95/L95,0)","v":0}]
[null,"16:40 3,3 Gtd PS Friz  Regular 6",null,null,{"$f":"IFERROR(IF(VLOOKUP($B96,Таблица1[],9,0)=0,\"\",VLOOKUP($B96,Таблица1[],9,0)),\"\")","v":""},{"$f":"IFERROR(VLOOKUP($B96,Таблица1[],16,0),\"\")","v":""},{"$f":"IFERROR(VLOOKUP($B96,Таблица1[],10,0),\"\")","v":""},{"$f":"IFERROR(VLOOKUP($B96,Таблица1[],11,0),\"\")","v":""},{"$f":"IFERROR(VLOOKUP($B96,Таблица1[],12,0),\"\")","v":""},{"$f":"IFERROR(VLOOKUP($B96,Таблица1[],13,0),\"\")","v":""},{"$f":"IFERROR(VLOOKUP($B96,Таблица1[],14,0),\"\")","v":""},{"$f":"COUNTIFS(Таблица1[2019],B96)+SUMIFS(Таблица1[Re-entry],Таблица1[2019],B96)","v":0},{"$f":"SUMIFS(Таблица1[Total Buy-In],Таблица1[2019],B96)","v":0},0,{"$f":"IFERROR(COUNTIFS(Таблица1[2019],B96,Таблица1[Winnings],\">0\")/L96*100,0)","v":0},{"$f":"SUMIFS(Таблица1[Total Hands],Таблица1[2019],B96)","v":0},{"$f":"IFERROR(SUMIFS(Таблица1[bb/101],Таблица1[2019],B96)/P96,0)","v":0},{"$f":"IFERROR(SUMIFS(Таблица1[EV bb/101],Таблица1[2019],B96)/P96,0)","v":0},{"$f":"SUMIFS(Таблица1[Net Winnings],Таблица1[2019],B96)","v":0},0]
[null,"16:45 1 SuperStack ES Friz  Regular 6",null,null,{"$f":"IFERROR(IF(VLOOKUP($B97,Таблица1[],9,0)=0,\"\",VLOOKUP($B97,Таблица1[],9,0)),\"\")","v":""},{"$f":"IFERROR(VLOOKUP($B97,Таблица1[],16,0),\"\")","v":""},{"$f":"IFERROR(VLOOKUP($B97,Таблица1[],10,0),\"\")","v":""},{"$f":"IFERROR(VLOOKUP($B97,Таблица1[],11,0),\"\")","v":""},{"$f":"IFERROR(VLOOKUP($B97,Таблица1[],12,0),\"\")","v":""},{"$f":"IFERROR(VLOOKUP($B97,Таблица1[],13,0),\"\")","v":""},{"$f":"IFERROR(VLOOKUP($B97,Таблица1[],14,0),\"\")","v":""},{"$f":"COUNTIFS(Таблица1[2019],B97)+SUMIFS(Таблица1[Re-entry],Таблица1[2019],B97)","v":0},{"$f":"SUMIFS(Таблица1[Total Buy-In],Таблица1[2019],B97)","v":0},{"$f":"IFERROR((S97/M97)*100,0)","v":0},{"$f":"IFERROR(COUNTIFS(Таблица1[2019],B97,Таблица1[Winnings],\">0\")/L97*100,0)","v":0},{"$f":"SUMIFS(Таблица1[Total Hands],Таблица1[2019],B97)","v":0},{"$f":"IFERROR(SUMIFS(Таблица1[bb/101],Таблица1[2019],B97)/P97,0)","v":0},{"$f":"IFERROR(SUMIFS(Таблица1[EV bb/101],Таблица1[2019],B97)/P97,0)","v":0},{"$f":"SUMIFS(Таблица1[Net Winnings],Таблица1[2019],B97)","v":0},{"$f":"IFERROR(S97/L97,0)","v":0}]
[null,"17:00 10 Satellite ES Friz  Regular 9",null,null,{"$f":"IFERROR(IF(VLOOKUP($B98,Таблица1[],9,0)=0,\"\",VLOOKUP($B98,Таблица1[],9,0)),\"\")","v":""},{"$f":"IFERROR(VLOOKUP($B98,Таблица1[],16,0),\"\")","v":""},{"$f":"IFERROR(VLOOKUP($B98,Таблица1[],10,0),\"\")","v":""},{"$f":"IFERROR(VLOOKUP($B98,Таблица1[],11,0),\"\")","v":""},{"$f":"IFERROR(VLOOKUP($B98,Таблица1[],12,0),\"\")","v":""},{"$f":"IFERROR(VLOOKUP($B98,Таблица1[],13,0),\"\")","v":""},{"$f":"IFERROR(VLOOKUP($B98,Таблица1[],14,0),\"\")","v":""},{"$f":"COUNTIFS(Таблица1[2019],B98)+SUMIFS(Таблица1[Re-entry],Таблица1[2019],B98)","v":0},{"$f":"SUMIFS(Таблица1[Total Buy-In],Таблица1[2019],B98)","v":0},0,{"$f":"IFERROR(COUNTIFS(Таблица1[2019],B98,Таблица1[Winnings],\">0\")/L98*100,0)","v":0},{"$f":"SUMIFS(Таблица1[Total Hands],Таблица1[2019],B98)","v":0},{"$f":"IFERROR(SUMIFS(Таблица1[bb/101],Таблица1[2019],B98)/P98,0)","v":0},{"$f":"IFERROR(SUMIFS(Таблица1[EV bb/101],Таблица1[2019],B98)/P98,0)","v":0},{"$f":"SUMIFS(Таблица1[Net Winnings],Таблица1[2019],B98)","v":0},0]
[null,"17:00 2,2 Gtd R/A PAC Friz  Regular 9",null,null,{"$f":"IFERROR(IF(VLOOKUP($B99,Таблица1[],9,0)=0,\"\",VLOOKUP($B99,Таблица1[],9,0)),\"\")","v":""},{"$f":"IFERROR(VLOOKUP($B99,Таблица1[],16,0),\"\")","v":""},{"$f":"IFERROR(VLOOKUP($B99,Таблица1[],10,0),\"\")","v":""},{"$f":"IFERROR(VLOOKUP($B99,Таблица1[],11,0),\"\")","v":""},{"$f":"IFERROR(VLOOKUP($B99,Таблица1[],12,0),\"\")","v":""},{"$f":"IFERROR(VLOOKUP($B99,Таблица1[],13,0),\"\")","v":""},{"$f":"IFERROR(VLOOKUP($B99,Таблица1[],14,0),\"\")","v":""},{"$f":"COUNTIFS(Таблица1[2019],B99)+SUMIFS(Таблица1[Re-entry],Таблица1[2019],B99)","v":0},{"$f":"SUMIFS(Таблица1[Total Buy-In],Таблица1[2019],B99)","v":0},0,{"$f":"IFERROR(COUNTIFS(Таблица1[2019],B99,Таблица1[Winnings],\">0\")/L99*100,0)","v":0},{"$f":"SUMIFS(Таблица1[Total Hands],Таблица1[2019],B99)","v":0},{"$f":"IFERROR(SUMIFS(Таблица1[bb/101],Таблица1[2019],B99)/P99,0)","v":0},{"$f":"IFERROR(SUMIFS(Таблица1[EV bb/101],Таблица1[2019],B99)/P99,0)","v":0},{"$f":"SUMIFS(Таблица1[Net Winnings],Таблица1[2019],B99)","v":0},0]
[null,"17:00 5 Big ES Friz  Regular 9",null,null,{"$f":"IFERROR(IF(VLOOKUP($B100,Таблица1[],9,0)=0,\"\",VLOOKUP($B100,Таблица1[],9,0)),\"\")","v":""},{"$f":"IFERROR(VLOOKUP($B100,Таблица1[],16,0),\"\")","v":""},{"$f":"IFERROR(VLOOKUP($B100,Таблица1[],10,0),\"\")","v":""},{"$f":"IFERROR(VLOOKUP($B100,Таблица1[],11,0),\"\")","v":""},{"$f":"IFERROR(VLOOKUP($B100,Таблица1[],12,0),\"\")","v":""},{"$f":"IFERROR(VLOOKUP($B100,Таблица1[],13,0),\"\")","v":""},{"$f":"IFERROR(VLOOKUP($B100,Таблица1[],14,0),\"\")","v":""},{"$f":"COUNTIFS(Таблица1[2019],B100)+SUMIFS(Таблица1[Re-entry],Таблица1[2019],B100)","v":0},{"$f":"SUMIFS(Таблица1[Total Buy-In],Таблица1[2019],B100)","v":0},0,{"$f":"IFERROR(COUNTIFS(Таблица1[2019],B100,Таблица1[Winnings],\">0\")/L100*100,0)","v":0},{"$f":"SUMIFS(Таблица1[Total Hands],Таблица1[2019],B100)","v":0},{"$f":"IFERROR(SUMIFS(Таблица1[bb/101],Таблица1[2019],B100)/P100,0)","v":0},{"$f":"IFERROR(SUMIFS(Таблица1[EV bb/101],Таблица1[2019],B100)/P100,0)","v":0},{"$f":"SUMIFS(Таблица1[Net Winnings],Таблица1[2019],B100)","v":0},0]
[null,"17:00 5,5 Big Fish PAC Friz  Regular 9",null,null,{"$f":"IFERROR(IF(VLOOKUP($B101,Таблица1[],9,0)=0,\"\",VLOOKUP($B101,Таблица1[],9,0)),\"\")","v":""},{"$f":"IFERROR(VLOOKUP($B101,Таблица1[],16,0),\"\")","v":""},{"$f":"IFERROR(VLOOKUP($B101,Таблица1[],10,0),\"\")","v":""},{"$f":"IFERROR(VLOOKUP($B101,Таблица1[],11,0),\"\")","v":""},{"$f":"IFERROR(VLOOKUP($B101,Таблица1[],12,0),\"\")","v":""},{"$f":"IFERROR(VLOOKUP($B101,Таблица1[],13,0),\"\")","v":""},{"$f":"IFERROR(VLOOKUP($B101,Таблица1[],14,0),\"\")","v":""},{"$f":"COUNTIFS(Таблица1[2019],B101)+SUMIFS(Таблица1[Re-entry],Таблица1[2019],B101)","v":0},{"$f":"SUMIFS(Таблица1[Total Buy-In],Таблица1[2019],B101)","v":0},0,{"$f":"IFERROR(COUNTIFS(Таблица1[2019],B101,Таблица1[Winnings],\">0\")/L101*100,0)","v":0},{"$f":"SUMIFS(Таблица1[Total Hands],Таблица1[2019],B101)","v":0},{"$f":"IFERROR(SUMIFS(Таблица1[bb/101],Таблица1[2019],B101)/P101,0)","v":0},{"$f":"IFERROR(SUMIFS(Таблица1[EV bb/101],Таблица1[2019],B101)/P101,0)","v":0},{"$f":"SUMIFS(Таблица1[Net Winnings],Таблица1[2019],B101)","v":0},0]
[null,"17:10 2,2 Gtd PS Friz  Regular 8",null,null,{"$f":"IFERROR(IF(VLOOKUP($B102,Таблица1[],9,0)=0,\"\",VLOOKUP($B102,Таблица1[],9,0)),\"\")","v":""},{"$f":"IFERROR(VLOOKUP($B102,Таблица1[],16,0),\"\")","v":""},{"$f":"IFERROR(VLOOKUP($B102,Таблица1[],10,0),\"\")","v":""},{"$f":"IFERROR(VLOOKUP($B102,Таблица1[],11,0),\"\")","v":""},{"$f":"IFERROR(VLOOKUP($B102,Таблица1[],12,0),\"\")","v":""},{"$f":"IFERROR(VLOOKUP($B102,Таблица1[],13,0),\"\")","v":""},{"$f":"IFERROR(VLOOKUP($B102,Таблица1[],14,0),\"\")","v":""},{"$f":"COUNTIFS(Таблица1[2019],B102)+SUMIFS(Таблица1[Re-entry],Таблица1[2019],B102)","v":0},{"$f":"SUMIFS(Таблица1[Total Buy-In],Таблица1[2019],B102)","v":0},{"$f":"IFERROR((S102/M102)*100,0)","v":0},{"$f":"IFERROR(COUNTIFS(Таблица1[2019],B102,Таблица1[Winnings],\">0\")/L102*100,0)","v":0},{"$f":"SUMIFS(Таблица1[Total Hands],Таблица1[2019],B102)","v":0},{"$f":"IFERROR(SUMIFS(Таблица1[bb/101],Таблица1[2019],B102)/P102,0)","v":0},{"$f":"IFERROR(SUMIFS(Таблица1[EV bb/101],Таблица1[2019],B102)/P102,0)","v":0},{"$f":"SUMIFS(Таблица1[Net Winnings],Таблица1[2019],B102)","v":0},{"$f":"IFERROR(S102/L102,0)","v":0}]
[null,"17:15 1,1 Progressive KO PS KO  Turbo 9",null,null,{"$f":"IFERROR(IF(VLOOKUP($B103,Таблица1[],9,0)=0,\"\",VLOOKUP($B103,Таблица1[],9,0)),\"\")","v":""},{"$f":"IFERROR(VLOOKUP($B103,Таблица1[],16,0),\"\")","v":""},{"$f":"IFERROR(VLOOKUP($B103,Таблица1[],10,0),\"\")","v":""},{"$f":"IFERROR(VLOOKUP($B103,Таблица1[],11,0),\"\")","v":""},{"$f":"IFERROR(VLOOKUP($B103,Таблица1[],12,0),\"\")","v":""},{"$f":"IFERROR(VLOOKUP($B103,Таблица1[],13,0),\"\")","v":""},{"$f":"IFERROR(VLOOKUP($B103,Таблица1[],14,0),\"\")","v":""},{"$f":"COUNTIFS(Таблица1[2019],B103)+SUMIFS(Таблица1[Re-entry],Таблица1[2019],B103)","v":0},{"$f":"SUMIFS(Таблица1[Total Buy-In],Таблица1[2019],B103)","v":0},0,{"$f":"IFERROR(COUNTIFS(Таблица1[2019],B103,Таблица1[Winnings],\">0\")/L103*100,0)","v":0},{"$f":"SUMIFS(Таблица1[Total Hands],Таблица1[2019],B103)","v":0},{"$f":"IFERROR(SUMIFS(Таблица1[bb/101],Таблица1[2019],B103)/P103,0)","v":0},{"$f":"IFERROR(SUMIFS(Таблица1[EV bb/101],Таблица1[2019],B103)/P103,0)","v":0},{"$f":"SUMIFS(Таблица1[Net Winnings],Таблица1[2019],B103)","v":0},0]
[null,"17:15 3,3 Mini Sunday Rebuy PS Friz  Regular 9",null,null,{"$f":"IFERROR(IF(VLOOKUP($B104,Таблица1[],9,0)=0,\"\",VLOOKUP($B104,Таблица1[],9,0)),\"\")","v":""},{"$f":"IFERROR(VLOOKUP($B104,Таблица1[],16,0),\"\")","v":""},{"$f":"IFERROR(VLOOKUP($B104,Таблица1[],10,0),\"\")","v":""},{"$f":"IFERROR(VLOOKUP($B104,Таблица1[],11,0),\"\")","v":""},{"$f":"IFERROR(VLOOKUP($B104,Таблица1[],12,0),\"\")","v":""},{"$f":"IFERROR(VLOOKUP($B104,Таблица1[],13,0),\"\")","v":""},{"$f":"IFERROR(VLOOKUP($B104,Таблица1[],14,0),\"\")","v":""},{"$f":"COUNTIFS(Таблица1[2019],B104)+SUMIFS(Таблица1[Re-entry],Таблица1[2019],B104)","v":0},{"$f":"SUMIFS(Таблица1[Total Buy-In],Таблица1[2019],B104)","v":0},0,{"$f":"IFERROR(COUNTIFS(Таблица1[2019],B104,Таблица1[Winnings],\">0\")/L104*100,0)","v":0},{"$f":"SUMIFS(Таблица1[Total Hands],Таблица1[2019],B104)","v":0},{"$f":"IFERROR(SUMIFS(Таблица1[bb/101],Таблица1[2019],B104)/P104,0)","v":0},{"$f":"IFERROR(SUMIFS(Таблица1[EV bb/101],Таблица1[2019],B104)/P104,0)","v":0},{"$f":"SUMIFS(Таблица1[Net Winnings],Таблица1[2019],B104)","v":0},0]
[null,"17:20 1 Gtd ES Friz  Turbo 9",null,null,{"$f":"IFERROR(IF(VLOOKUP($B105,Таблица1[],9,0)=0,\"\",VLOOKUP($B105,Таблица1[],9,0)),\"\")","v":""},{"$f":"IFERROR(VLOOKUP($B105,Таблица1[],16,0),\"\")","v":""},{"$f":"IFERROR(VLOOKUP($B105,Таблица1[],10,0),\"\")","v":""},{"$f":"IFERROR(VLOOKUP($B105,Таблица1[],11,0),\"\")","v":""},{"$f":"IFERROR(VLOOKUP($B105,Таблица1[],12,0),\"\")","v":""},{"$f":"IFERROR(VLOOKUP($B105,Таблица1[],13,0),\"\")","v":""},{"$f":"IFERROR(VLOOKUP($B105,Таблица1[],14,0),\"\")","v":""},{"$f":"COUNTIFS(Таблица1[2019],B105)+SUMIFS(Таблица1[Re-entry],Таблица1[2019],B105)","v":0},{"$f":"SUMIFS(Таблица1[Total Buy-In],Таблица1[2019],B105)","v":0},0,{"$f":"IFERROR(COUNTIFS(Таблица1[2019],B105,Таблица1[Winnings],\">0\")/L105*100,0)","v":0},{"$f":"SUMIFS(Таблица1[Total Hands],Таблица1[2019],B105)","v":0},{"$f":"IFERROR(SUMIFS(Таблица1[bb/101],Таблица1[2019],B105)/P105,0)","v":0},{"$f":"IFERROR(SUMIFS(Таблица1[EV bb/101],Таблица1[2019],B105)/P105,0)","v":0},{"$f":"SUMIFS(Таблица1[Net Winnings],Таблица1[2019],B105)","v":0},0]
[null,"17:30 0,55 Gtd PS Friz  Turbo 9",null,null,{"$f":"IFERROR(IF(VLOOKUP($B106,Таблица1[],9,0)=0,\"\",VLOOKUP($B106,Таблица1[],9,0)),\"\")","v":""},{"$f":"IFERROR(VLOOKUP($B106,Таблица1[],16,0),\"\")","v":""},{"$f":"IFERROR(VLOOKUP($B106,Таблица1[],10,0),\"\")","v":""},{"$f":"IFERROR(VLOOKUP($B106,Таблица1[],11,0),\"\")","v":""},{"$f":"IFERROR(VLOOKUP($B106,Таблица1[],12,0),\"\")","v":""},{"$f":"IFERROR(VLOOKUP($B106,Таблица1[],13,0),\"\")","v":""},{"$f":"IFERROR(VLOOKUP($B106,Таблица1[],14,0),\"\")","v":""},{"$f":"COUNTIFS(Таблица1[2019],B106)+SUMIFS(Таблица1[Re-entry],Таблица1[2019],B106)","v":0},{"$f":"SUMIFS(Таблица1[Total Buy-In],Таблица1[2019],B106)","v":0},0,{"$f":"IFERROR(COUNTIFS(Таблица1[2019],B106,Таблица1[Winnings],\">0\")/L106*100,0)","v":0},{"$f":"SUMIFS(Таблица1[Total Hands],Таблица1[2019],B106)","v":0},{"$f":"IFERROR(SUMIFS(Таблица1[bb/101],Таблица1[2019],B106)/P106,0)","v":0},{"$f":"IFERROR(SUMIFS(Таблица1[EV bb/101],Таблица1[2019],B106)/P106,0)","v":0},{"$f":"SUMIFS(Таблица1[Net Winnings],Таблица1[2019],B106)","v":0},0]
[null,"17:40 1 Gtd ES Friz  Regular 9",null,null,{"$f":"IFERROR(IF(VLOOKUP($B107,Таблица1[],9,0)=0,\"\",VLOOKUP($B107,Таблица1[],9,0)),\"\")","v":""},{"$f":"IFERROR(VLOOKUP($B107,Таблица1[],16,0),\"\")","v":""},{"$f":"IFERROR(VLOOKUP($B107,Таблица1[],10,0),\"\")","v":""},{"$f":"IFERROR(VLOOKUP($B107,Таблица1[],11,0),\"\")","v":""},{"$f":"IFERROR(VLOOKUP($B107,Таблица1[],12,0),\"\")","v":""},{"$f":"IFERROR(VLOOKUP($B107,Таблица1[],13,0),\"\")","v":""},{"$f":"IFERROR(VLOOKUP($B107,Таблица1[],14,0),\"\")","v":""},{"$f":"COUNTIFS(Таблица1[2019],B107)+SUMIFS(Таблица1[Re-entry],Таблица1[2019],B107)","v":0},{"$f":"SUMIFS(Таблица1[Total Buy-In],Таблица1[2019],B107)","v":0},0,{"$f":"IFERROR(COUNTIFS(Таблица1[2019],B107,Таблица1[Winnings],\">0\")/L107*100,0)","v":0},{"$f":"SUMIFS(Таблица1[Total Hands],Таблица1[2019],B107)","v":0},{"$f":"IFERROR(SUMIFS(Таблица1[bb/101],Таблица1[2019],B107)/P107,0)","v":0},{"$f":"IFERROR(SUMIFS(Таблица1[EV bb/101],Таблица1[2019],B107)/P107,0)","v":0},{"$f":"SUMIFS(Таблица1[Net Winnings],Таблица1[2019],B107)","v":0},0]
[null,"17:40 1,1 Gtd PS Friz  Regular 9",null,null,{"$f":"IFERROR(IF(VLOOKUP($B108,Таблица1[],9,0)=0,\"\",VLOOKUP($B108,Таблица1[],9,0)),\"\")","v":""},{"$f":"IFERROR(VLOOKUP($B108,Таблица1[],16,0),\"\")","v":""},{"$f":"IFERROR(VLOOKUP($B108,Таблица1[],10,0),\"\")","v":""},{"$f":"IFERROR(VLOOKUP($B108,Таблица1[],11,0),\"\")","v":""},{"$f":"IFERROR(VLOOKUP($B108,Таблица1[],12,0),\"\")","v":""},{"$f":"IFERROR(VLOOKUP($B108,Таблица1[],13,0),\"\")","v":""},{"$f":"IFERROR(VLOOKUP($B108,Таблица1[],14,0),\"\")","v":""},{"$f":"COUNTIFS(Таблица1[2019],B108)+SUMIFS(Таблица1[Re-entry],Таблица1[2019],B108)","v":0},{"$f":"SUMIFS(Таблица1[Total Buy-In],Таблица1[2019],B108)","v":0},0,{"$f":"IFERROR(COUNTIFS(Таблица1[2019],B108,Таблица1[Winnings],\">0\")/L108*100,0)","v":0},{"$f":"SUMIFS(Таблица1[Total Hands],Таблица1[2019],B108)","v":0},{"$f":"IFERROR(SUMIFS(Таблица1[bb/101],Таблица1[2019],B108)/P108,0)","v":0},{"$f":"IFERROR(SUMIFS(Таблица1[EV bb/101],Таблица1[2019],B108)/P108,0)","v":0},{"$f":"SUMIFS(Таблица1[Net Winnings],Таблица1[2019],B108)","v":0},0]
[null,"18:00 1,1 Satellite PS Friz  Regular 8",null,null,{"$f":"IFERROR(IF(VLOOKUP($B109,Таблица1[],9,0)=0,\"\",VLOOKUP($B109,Таблица1[],9,0)),\"\")","v":""},{"$f":"IFERROR(VLOOKUP($B109,Таблица1[],16,0),\"\")","v":""},{"$f":"IFERROR(VLOOKUP($B109,Таблица1[],10,0),\"\")","v":""},{"$f":"IFERROR(VLOOKUP($B109,Таблица1[],11,0),\"\")","v":""},{"$f":"IFERROR(VLOOKUP($B109,Таблица1[],12,0),\"\")","v":""},{"$f":"IFERROR(VLOOKUP($B109,Таблица1[],13,0),\"\")","v":""},{"$f":"IFERROR(VLOOKUP($B109,Таблица1[],14,0),\"\")","v":""},{"$f":"COUNTIFS(Таблица1[2019],B109)+SUMIFS(Таблица1[Re-entry],Таблица1[2019],B109)","v":0},{"$f":"SUMIFS(Таблица1[Total Buy-In],Таблица1[2019],B109)","v":0},0,{"$f":"IFERROR(COUNTIFS(Таблица1[2019],B109,Таблица1[Winnings],\">0\")/L109*100,0)","v":0},{"$f":"SUMIFS(Таблица1[Total Hands],Таблица1[2019],B109)","v":0},{"$f":"IFERROR(SUMIFS(Таблица1[bb/101],Таблица1[2019],B109)/P109,0)","v":0},{"$f":"IFERROR(SUMIFS(Таблица1[EV bb/101],Таблица1[2019],B109)/P109,0)","v":0},{"$f":"SUMIFS(Таблица1[Net Winnings],Таблица1[2019],B109)","v":0},0]
[null,"18:00 3 Mini Swordfish PAC Friz  Regular 9",null,null,{"$f":"IFERROR(IF(VLOOKUP($B110,Таблица1[],9,0)=0,\"\",VLOOKUP($B110,Таблица1[],9,0)),\"\")","v":""},{"$f":"IFERROR(VLOOKUP($B110,Таблица1[],16,0),\"\")","v":""},{"$f":"IFERROR(VLOOKUP($B110,Таблица1[],10,0),\"\")","v":""},{"$f":"IFERROR(VLOOKUP($B110,Таблица1[],11,0),\"\")","v":""},{"$f":"IFERROR(VLOOKUP($B110,Таблица1[],12,0),\"\")","v":""},{"$f":"IFERROR(VLOOKUP($B110,Таблица1[],13,0),\"\")","v":""},{"$f":"IFERROR(VLOOKUP($B110,Таблица1[],14,0),\"\")","v":""},{"$f":"COUNTIFS(Таблица1[2019],B110)+SUMIFS(Таблица1[Re-entry],Таблица1[2019],B110)","v":0},{"$f":"SUMIFS(Таблица1[Total Buy-In],Таблица1[2019],B110)","v":0},0,{"$f":"IFERROR(COUNTIFS(Таблица1[2019],B110,Таблица1[Winnings],\">0\")/L110*100,0)","v":0},{"$f":"SUMIFS(Таблица1[Total Hands],Таблица1[2019],B110)","v":0},{"$f":"IFERROR(SUMIFS(Таблица1[bb/101],Таблица1[2019],B110)/P110,0)","v":0},{"$f":"IFERROR(SUMIFS(Таблица1[EV bb/101],Таблица1[2019],B110)/P110,0)","v":0},{"$f":"SUMIFS(Таблица1[Net Winnings],Таблица1[2019],B110)","v":0},0]
[null,"18:15 3 Big ES Friz  Regular 9",null,null,{"$f":"IFERROR(IF(VLOOKUP($B111,Таблица1[],9,0)=0,\"\",VLOOKUP($B111,Таблица1[],9,0)),\"\")","v":""},{"$f":"IFERROR(VLOOKUP($B111,Таблица1[],16,0),\"\")","v":""},{"$f":"IFERROR(VLOOKUP($B111,Таблица1[],10,0),\"\")","v":""},{"$f":"IFERROR(VLOOKUP($B111,Таблица1[],11,0),\"\")","v":""},{"$f":"IFERROR(VLOOKUP($B111,Таблица1[],12,0),\"\")","v":""},{"$f":"IFERROR(VLOOKUP($B111,Таблица1[],13,0),\"\")","v":""},{"$f":"IFERROR(VLOOKUP($B111,Таблица1[],14,0),\"\")","v":""},{"$f":"COUNTIFS(Таблица1[2019],B111)+SUMIFS(Таблица1[Re-entry],Таблица1[2019],B111)","v":0},{"$f":"SUMIFS(Таблица1[Total Buy-In],Таблица1[2019],B111)","v":0},0,{"$f":"IFERROR(COUNTIFS(Таблица1[2019],B111,Таблица1[Winnings],\">0\")/L111*100,0)","v":0},{"$f":"SUMIFS(Таблица1[Total Hands],Таблица1[2019],B111)","v":0},{"$f":"IFERROR(SUMIFS(Таблица1[bb/101],Таблица1[2019],B111)/P111,0)","v":0},{"$f":"IFERROR(SUMIFS(Таблица1[EV bb/101],Таблица1[2019],B111)/P111,0)","v":0},{"$f":"SUMIFS(Таблица1[Net Winnings],Таблица1[2019],B111)","v":0},0]
[null,"18:15 3,3 Player Cap PS Friz  Regular 9",null,null,{"$f":"IFERROR(IF(VLOOKUP($B112,Таблица1[],9,0)=0,\"\",VLOOKUP($B112,Таблица1[],9,0)),\"\")","v":""},{"$f":"IFERROR(VLOOKUP($B112,Таблица1[],16,0),\"\")","v":""},{"$f":"IFERROR(VLOOKUP($B112,Таблица1[],10,0),\"\")","v":""},{"$f":"IFERROR(VLOOKUP($B112,Таблица1[],11,0),\"\")","v":""},{"$f":"IFERROR(VLOOKUP($B112,Таблица1[],12,0),\"\")","v":""},{"$f":"IFERROR(VLOOKUP($B112,Таблица1[],13,0),\"\")","v":""},{"$f":"IFERROR(VLOOKUP($B112,Таблица1[],14,0),\"\")","v":""},{"$f":"COUNTIFS(Таблица1[2019],B112)+SUMIFS(Таблица1[Re-entry],Таблица1[2019],B112)","v":0},{"$f":"SUMIFS(Таблица1[Total Buy-In],Таблица1[2019],B112)","v":0},0,{"$f":"IFERROR(COUNTIFS(Таблица1[2019],B112,Таблица1[Winnings],\">0\")/L112*100,0)","v":0},{"$f":"SUMIFS(Таблица1[Total Hands],Таблица1[2019],B112)","v":0},{"$f":"IFERROR(SUMIFS(Таблица1[bb/101],Таблица1[2019],B112)/P112,0)","v":0},{"$f":"IFERROR(SUMIFS(Таблица1[EV bb/101],Таблица1[2019],B112)/P112,0)","v":0},{"$f":"SUMIFS(Таблица1[Net Winnings],Таблица1[2019],B112)","v":0},0]
[null,"18:25 0,55 Bubble Rush PS Friz  Turbo 9",null,null,{"$f":"IFERROR(IF(VLOOKUP($B113,Таблица1[],9,0)=0,\"\",VLOOKUP($B113,Таблица1[],9,0)),\"\")","v":""},{"$f":"IFERROR(VLOOKUP($B113,Таблица1[],16,0),\"\")","v":""},{"$f":"IFERROR(VLOOKUP($B113,Таблица1[],10,0),\"\")","v":""},{"$f":"IFERROR(VLOOKUP($B113,Таблица1[],11,0),\"\")","v":""},{"$f":"IFERROR(VLOOKUP($B113,Таблица1[],12,0),\"\")","v":""},{"$f":"IFERROR(VLOOKUP($B113,Таблица1[],13,0),\"\")","v":""},{"$f":"IFERROR(VLOOKUP($B113,Таблица1[],14,0),\"\")","v":""},{"$f":"COUNTIFS(Таблица1[2019],B113)+SUMIFS(Таблица1[Re-entry],Таблица1[2019],B113)","v":0},{"$f":"SUMIFS(Таблица1[Total Buy-In],Таблица1[2019],B113)","v":0},0,{"$f":"IFERROR(COUNTIFS(Таблица1[2019],B113,Таблица1[Winnings],\">0\")/L113*100,0)","v":0},{"$f":"SUMIFS(Таблица1[Total Hands],Таблица1[2019],B113)","v":0},{"$f":"IFERROR(SUMIFS(Таблица1[bb/101],Таблица1[2019],B113)/P113,0)","v":0},{"$f":"IFERROR(SUMIFS(Таблица1[EV bb/101],Таблица1[2019],B113)/P113,0)","v":0},{"$f":"SUMIFS(Таблица1[Net Winnings],Таблица1[2019],B113)","v":0},0]
[null,"18:30 2,2 Bounty Builder PS KO  Regular 9",null,null,{"$f":"IFERROR(IF(VLOOKUP($B114,Таблица1[],9,0)=0,\"\",VLOOKUP($B114,Таблица1[],9,0)),\"\")","v":""},{"$f":"IFERROR(VLOOKUP($B114,Таблица1[],16,0),\"\")","v":""},{"$f":"IFERROR(VLOOKUP($B114,Таблица1[],10,0),\"\")","v":""},{"$f":"IFERROR(VLOOKUP($B114,Таблица1[],11,0),\"\")","v":""},{"$f":"IFERROR(VLOOKUP($B114,Таблица1[],12,0),\"\")","v":""},{"$f":"IFERROR(VLOOKUP($B114,Таблица1[],13,0),\"\")","v":""},{"$f":"IFERROR(VLOOKUP($B114,Таблица1[],14,0),\"\")","v":""},{"$f":"COUNTIFS(Таблица1[2019],B114)+SUMIFS(Таблица1[Re-entry],Таблица1[2019],B114)","v":0},{"$f":"SUMIFS(Таблица1[Total Buy-In],Таблица1[2019],B114)","v":0},0,{"$f":"IFERROR(COUNTIFS(Таблица1[2019],B114,Таблица1[Winnings],\">0\")/L114*100,0)","v":0},{"$f":"SUMIFS(Таблица1[Total Hands],Таблица1[2019],B114)","v":0},{"$f":"IFERROR(SUMIFS(Таблица1[bb/101],Таблица1[2019],B114)/P114,0)","v":0},{"$f":"IFERROR(SUMIFS(Таблица1[EV bb/101],Таблица1[2019],B114)/P114,0)","v":0},{"$f":"SUMIFS(Таблица1[Net Winnings],Таблица1[2019],B114)","v":0},0]
[null,"18:40 1,1 Zoom PS Friz  Turbo 9",null,null,{"$f":"IFERROR(IF(VLOOKUP($B115,Таблица1[],9,0)=0,\"\",VLOOKUP($B115,Таблица1[],9,0)),\"\")","v":""},{"$f":"IFERROR(VLOOKUP($B115,Таблица1[],16,0),\"\")","v":""},{"$f":"IFERROR(VLOOKUP($B115,Таблица1[],10,0),\"\")","v":""},{"$f":"IFERROR(VLOOKUP($B115,Таблица1[],11,0),\"\")","v":""},{"$f":"IFERROR(VLOOKUP($B115,Таблица1[],12,0),\"\")","v":""},{"$f":"IFERROR(VLOOKUP($B115,Таблица1[],13,0),\"\")","v":""},{"$f":"IFERROR(VLOOKUP($B115,Таблица1[],14,0),\"\")","v":""},{"$f":"COUNTIFS(Таблица1[2019],B115)+SUMIFS(Таблица1[Re-entry],Таблица1[2019],B115)","v":0},{"$f":"SUMIFS(Таблица1[Total Buy-In],Таблица1[2019],B115)","v":0},{"$f":"IFERROR((S115/M115)*100,0)","v":0},{"$f":"IFERROR(COUNTIFS(Таблица1[2019],B115,Таблица1[Winnings],\">0\")/L115*100,0)","v":0},{"$f":"SUMIFS(Таблица1[Total Hands],Таблица1[2019],B115)","v":0},{"$f":"IFERROR(SUMIFS(Таблица1[bb/101],Таблица1[2019],B115)/P115,0)","v":0},{"$f":"IFERROR(SUMIFS(Таблица1[EV bb/101],Таблица1[2019],B115)/P115,0)","v":0},{"$f":"SUMIFS(Таблица1[Net Winnings],Таблица1[2019],B115)","v":0},{"$f":"IFERROR(S115/L115,0)","v":0}]
[null,"18:45 1 Gtd ES Friz  Regular 6",null,null,{"$f":"IFERROR(IF(VLOOKUP($B116,Таблица1[],9,0)=0,\"\",VLOOKUP($B116,Таблица1[],9,0)),\"\")","v":""},{"$f":"IFERROR(VLOOKUP($B116,Таблица1[],16,0),\"\")","v":""},{"$f":"IFERROR(VLOOKUP($B116,Таблица1[],10,0),\"\")","v":""},{"$f":"IFERROR(VLOOKUP($B116,Таблица1[],11,0),\"\")","v":""},{"$f":"IFERROR(VLOOKUP($B116,Таблица1[],12,0),\"\")","v":""},{"$f":"IFERROR(VLOOKUP($B116,Таблица1[],13,0),\"\")","v":""},{"$f":"IFERROR(VLOOKUP($B116,Таблица1[],14,0),\"\")","v":""},{"$f":"COUNTIFS(Таблица1[2019],B116)+SUMIFS(Таблица1[Re-entry],Таблица1[2019],B116)","v":0},{"$f":"SUMIFS(Таблица1[Total Buy-In],Таблица1[2019],B116)","v":0},0,{"$f":"IFERROR(COUNTIFS(Таблица1[2019],B116,Таблица1[Winnings],\">0\")/L116*100,0)","v":0},{"$f":"SUMIFS(Таблица1[Total Hands],Таблица1[2019],B116)","v":0},{"$f":"IFERROR(SUMIFS(Таблица1[bb/101],Таблица1[2019],B116)/P116,0)","v":0},{"$f":"IFERROR(SUMIFS(Таблица1[EV bb/101],Таблица1[2019],B116)/P116,0)","v":0},{"$f":"SUMIFS(Таблица1[Net Winnings],Таблица1[2019],B116)","v":0},0]
[null,"19:00 1 Deep Stacks ES Friz  Regular 6",null,null,{"$f":"IFERROR(IF(VLOOKUP($B117,Таблица1[],9,0)=0,\"\",VLOOKUP($B117,Таблица1[],9,0)),\"\")","v":""},{"$f":"IFERROR(VLOOKUP($B117,Таблица1[],16,0),\"\")","v":""},{"$f":"IFERROR(VLOOKUP($B117,Таблица1[],10,0),\"\")","v":""},{"$f":"IFERROR(VLOOKUP($B117,Таблица1[],11,0),\"\")","v":""},{"$f":"IFERROR(VLOOKUP($B117,Таблица1[],12,0),\"\")","v":""},{"$f":"IFERROR(VLOOKUP($B117,Таблица1[],13,0),\"\")","v":""},{"$f":"IFERROR(VLOOKUP($B117,Таблица1[],14,0),\"\")","v":""},{"$f":"COUNTIFS(Таблица1[2019],B117)+SUMIFS(Таблица1[Re-entry],Таблица1[2019],B117)","v":0},{"$f":"SUMIFS(Таблица1[Total Buy-In],Таблица1[2019],B117)","v":0},0,{"$f":"IFERROR(COUNTIFS(Таблица1[2019],B117,Таблица1[Winnings],\">0\")/L117*100,0)","v":0},{"$f":"SUMIFS(Таблица1[Total Hands],Таблица1[2019],B117)","v":0},{"$f":"IFERROR(SUMIFS(Таблица1[bb/101],Таблица1[2019],B117)/P117,0)","v":0},{"$f":"IFERROR(SUMIFS(Таблица1[EV bb/101],Таблица1[2019],B117)/P117,0)","v":0},{"$f":"SUMIFS(Таблица1[Net Winnings],Таблица1[2019],B117)","v":0},0]
[null,"19:00 3,3 Big PS Friz  Regular 9",null,null,{"$f":"IFERROR(IF(VLOOKUP($B118,Таблица1[],9,0)=0,\"\",VLOOKUP($B118,Таблица1[],9,0)),\"\")","v":""},{"$f":"IFERROR(VLOOKUP($B118,Таблица1[],16,0),\"\")","v":""},{"$f":"IFERROR(VLOOKUP($B118,Таблица1[],10,0),\"\")","v":""},{"$f":"IFERROR(VLOOKUP($B118,Таблица1[],11,0),\"\")","v":""},{"$f":"IFERROR(VLOOKUP($B118,Таблица1[],12,0),\"\")","v":""},{"$f":"IFERROR(VLOOKUP($B118,Таблица1[],13,0),\"\")","v":""},{"$f":"IFERROR(VLOOKUP($B118,Таблица1[],14,0),\"\")","v":""},{"$f":"COUNTIFS(Таблица1[2019],B118)+SUMIFS(Таблица1[Re-entry],Таблица1[2019],B118)","v":0},{"$f":"SUMIFS(Таблица1[Total Buy-In],Таблица1[2019],B118)","v":0},0,{"$f":"IFERROR(COUNTIFS(Таблица1[2019],B118,Таблица1[Winnings],\">0\")/L118*100,0)","v":0},{"$f":"SUMIFS(Таблица1[Total Hands],Таблица1[2019],B118)","v":0},{"$f":"IFERROR(SUMIFS(Таблица1[bb/101],Таблица1[2019],B118)/P118,0)","v":0},{"$f":"IFERROR(SUMIFS(Таблица1[EV bb/101],Таблица1[2019],B118)/P118,0)","v":0},{"$f":"SUMIFS(Таблица1[Net Winnings],Таблица1[2019],B118)","v":0},0]
[null,"19:15 1 SuperStack ES Friz  Regular 6",null,null,{"$f":"IFERROR(IF(VLOOKUP($B119,Таблица1[],9,0)=0,\"\",VLOOKUP($B119,Таблица1[],9,0)),\"\")","v":""},{"$f":"IFERROR(VLOOKUP($B119,Таблица1[],16,0),\"\")","v":""},{"$f":"IFERROR(VLOOKUP($B119,Таблица1[],10,0),\"\")","v":""},{"$f":"IFERROR(VLOOKUP($B119,Таблица1[],11,0),\"\")","v":""},{"$f":"IFERROR(VLOOKUP($B119,Таблица1[],12,0),\"\")","v":""},{"$f":"IFERROR(VLOOKUP($B119,Таблица1[],13,0),\"\")","v":""},{"$f":"IFERROR(VLOOKUP($B119,Таблица1[],14,0),\"\")","v":""},{"$f":"COUNTIFS(Таблица1[2019],B119)+SUMIFS(Таблица1[Re-entry],Таблица1[2019],B119)","v":0},{"$f":"SUMIFS(Таблица1[Total Buy-In],Таблица1[2019],B119)","v":0},0,{"$f":"IFERROR(COUNTIFS(Таблица1[2019],B119,Таблица1[Winnings],\">0\")/L119*100,0)","v":0},{"$f":"SUMIFS(Таблица1[Total Hands],Таблица1[2019],B119)","v":0},{"$f":"IFERROR(SUMIFS(Таблица1[bb/101],Таблица1[2019],B119)/P119,0)","v":0},{"$f":"IFERROR(SUMIFS(Таблица1[EV bb/101],Таблица1[2019],B119)/P119,0)","v":0},{"$f":"SUMIFS(Таблица1[Net Winnings],Таблица1[2019],B119)","v":0},0]
[null,"19:15 2,2 Gtd PS Friz  Turbo 9",null,null,{"$f":"IFERROR(IF(VLOOKUP($B120,Таблица1[],9,0)=0,\"\",VLOOKUP($B120,Таблица1[],9,0)),\"\")","v":""},{"$f":"IFERROR(VLOOKUP($B120,Таблица1[],16,0),\"\")","v":""},{"$f":"IFERROR(VLOOKUP($B120,Таблица1[],10,0),\"\")","v":""},{"$f":"IFERROR(VLOOKUP($B120,Таблица1[],11,0),\"\")","v":""},{"$f":"IFERROR(VLOOKUP($B120,Таблица1[],12,0),\"\")","v":""},{"$f":"IFERROR(VLOOKUP($B120,Таблица1[],13,0),\"\")","v":""},{"$f":"IFERROR(VLOOKUP($B120,Таблица1[],14,0),\"\")","v":""},{"$f":"COUNTIFS(Таблица1[2019],B120)+SUMIFS(Таблица1[Re-entry],Таблица1[2019],B120)","v":0},{"$f":"SUMIFS(Таблица1[Total Buy-In],Таблица1[2019],B120)","v":0},0,{"$f":"IFERROR(COUNTIFS(Таблица1[2019],B120,Таблица1[Winnings],\">0\")/L120*100,0)","v":0},{"$f":"SUMIFS(Таблица1[Total Hands],Таблица1[2019],B120)","v":0},{"$f":"IFERROR(SUMIFS(Таблица1[bb/101],Таблица1[2019],B120)/P120,0)","v":0},{"$f":"IFERROR(SUMIFS(Таблица1[EV bb/101],Таблица1[2019],B120)/P120,0)","v":0},{"$f":"SUMIFS(Таблица1[Net Winnings],Таблица1[2019],B120)","v":0},0]
[null,"19:25 1,1 Gtd PS Friz  Regular 6"]
[null,"19:30 0,55 Bounty Builder PS KO  Regular 9"]
[null,"19:45 0,55 Gtd PS Friz  Turbo 8"]
[null,"20:00 1,1 Big PS Friz  Regular 9"]
[null,"20:00 1,1 MicroMillions PS Friz  Turbo 9"]
[null,"20:15 0,55 Hot PS Friz  Turbo 9"]
[null,"20:15 3 SuperStack ES Friz  Regular 6"]
[null,"20:30 3,3 Bounty Builder PS KO  Regular 9"]
[null,"21:00 0,55 Big PS Friz  Regular 9"]
[null,"21:00 2,2 Micro Fast Friday PS Friz  Turbo 8"]
[null,"21:00 22 MicroMillions PS Friz  Regular 8"]
[null,"21:05 11 Sunday Storm PS Friz  Regular 9"]
[null,"21:10 3,3 Player Cap PS Friz  Regular 9"]
[null,"21:15 1,1 Splash R/a PS Friz  Turbo 9"]
[null,"21:15 2 Big ES Friz  Regular 9"]
[null,"21:15 2,2 Hot PS Friz  Turbo 9"]
[null,"21:30 1,1 Bounty Builder PS KO  Regular 9"]
[null,"21:40 3,3 Zoom PS Friz  Turbo 9"]
[null,"22:00 1 Daily Micro ES Friz  Regular 9"]
[null,"22:00 2,2 Big PS Friz  Regular 9"]
[null,"22:00 50 MicroMillions ES Friz  Regular 9"]
[null,"22:15 3,3 Hot PS Friz  Turbo 9"]
[null,"22:25 1 Bubble Rush ES Friz  Turbo 9"]
[null,"22:30 1,1 Player Cap PS Friz  Regular 9"]
[null,"22:50 3,3 Gtd PS Friz  Regular 6"]
[null,"23:10 2,2 Deep Stacks PS Friz  Regular 9"]
[null,"23:15 1,1 Hot PS Friz  Turbo 9"]
[null,"23:30 2,2 Bounty Builder PS KO  Regular 9"]
[null,"23:40 3,3 Gtd PS Friz  Regular 8"]
[null,"Общий итог"]

{"sheet":"HM","index":2,"n_rows":6,"n_cols":15,"rows_kept":6,"cut":false,"hidden":false,"merged":[]}
[]
[null,"Number","Hand Date","Start Time","End Time","Size","Table size","Total Buy-In","Finish","Winnings","Net Winnings","Total Hands","bb/100","EV bb/100","Player"]
[null,2640633096,"2019-07-01","2019-07-01T09:10:06","2019-07-01T09:23:25",45,9,0.25,38,0,-0.25,13,-563.33000000000004,-561.84,"mâro (PS)"]
[null,2640635094,"2019-07-01","2019-07-01T09:23:35","2019-07-01T10:42:14",45,9,0.25,11,0,-0.25,110,-18.41,-43.95,"mâro (PS)"]
[null,2640638091,"2019-07-01","2019-07-01T09:31:12","2019-07-01T09:52:34",45,9,0.25,31,0,-0.25,19,-153.93,253.05,"mâro (PS)"]
[null,2640644187,"2019-07-01","2019-07-01T09:59:29","2019-07-01T12:19:26",45,9,0.25,1,3.23,2.98,274,73.12,35.85,"mâro (PS)"]

{"sheet":"BAZA()","index":3,"n_rows":7,"n_cols":29,"rows_kept":7,"cut":false,"hidden":false,"merged":[]}
[]
[{"$nulls":10},{"$f":"COUNTIFS(Таблица1[Name],\"=0\")","v":0},{"$f":"COUNTIFS(Таблица1[Room],88)","v":0},{"$f":"COUNTIFS(Таблица1[KO/Friz],\"=0\")","v":0},{"$f":"COUNTIFS(Таблица1[Speed],\"=0\")","v":0}]
[null,"2019","Meset","No","deni nedeli","Number","Date","Столбец3","Столбец4","Start","Name","Room","KO/Friz","Speed","Table size","Size","Buy-In","R/A","Re-entry","Total Buy-In","Finish","Winnings","Net Winnings","Total Hands","bb/100","EV bb/100","bb/101","EV bb/101","2"]
[null,{"$f":"IF(Таблица1[[#This Row],[Number]]=\"\",\"\",CONCATENATE(TEXT(TIME(HOUR(J4),MINUTE(J4),0),\"[hh]:mm;@\"),\" \",Таблица1[[#This Row],[Buy-In]],\" \",Таблица1[[#This Row],[Name]],\" \",Таблица1[[#This Row],[Room]],\" \",Таблица1[[#This Row],[KO/Friz]],\"  \",Таблица1[[#This Row],[Speed]],\" \",Таблица1[[#This Row],[Table size]]))","v":"00:00 0,25 45 Max PS Friz  Regular 9"},{"$f":"IF(Таблица1[[#This Row],[Number]]=\"\",\"\",TEXT(Таблица1[[#This Row],[Date]],\"mmmm\"))","v":"июль"},{"$f":"IF(Таблица1[[#This Row],[Number]]=\"\",\"\",WEEKNUM(Таблица1[[#This Row],[Date]],2))","v":27},{"$f":"IF(Таблица1[[#This Row],[Number]]=\"\",\"\",CHOOSE(WEEKDAY(Таблица1[[#This Row],[Date]],2),\"понедельник\",\"вторник\",\"среда\",\"четверг\",\"пятница\",\"суббота\",\"воскресенье\"))","v":"понедельник"},{"$f":"IFERROR(INDEX(Таблица2[Number],MATCH(0,COUNTIF($F$3:F3,Таблица2[Number]),0)),\"\")","v":2640633096},{"$f":"IF(Таблица1[[#This Row],[Number]]=\"\",\"\",VLOOKUP(Таблица1[[#This Row],[Number]],Таблица2[],2,0))","v":"2019-07-01"},{"$f":"IF(Таблица1[[#This Row],[Number]]=\"\",\"\",VLOOKUP(Таблица1[[#This Row],[Number]],Таблица2[],3,0))","v":43647.382013888891},{"$f":"IF(Таблица1[[#This Row],[Number]]=\"\",\"\",VLOOKUP(Таблица1[[#This Row],[Number]],Таблица2[],4,0))","v":43647.391261574077},null,{"$f":"IF(OR(CONCATENATE(Таблица1[[#This Row],[Buy-In]],Таблица1[[#This Row],[Size]])  =\"0,2545\",  CONCATENATE(Таблица1[[#This Row],[Buy-In]],Таблица1[[#This Row],[Size]])  =\"0,545\", CONCATENATE(Таблица1[[#This Row],[Buy-In]],Таблица1[[#This Row],[Size]])  =\"145\"  ),    \"45 Max\", IF(OR(CONCATENATE(Таблица1[[#This Row],[Buy-In]],Таблица1[[#This Row],[Size]])  =\"1180\",  CONCATENATE(Таблица1[[#This Row],[Buy-In]],Таблица1[[#This Row],[Size]])  =\"1180\"), \"180 Max\",\"\")  )","v":"45 Max"},{"$f":"IF(Таблица1[[#This Row],[Number]]=\"\",\"\",IF(VLOOKUP(Таблица1[[#This Row],[Number]],Таблица2[],14,0)=\"mâro (PS)\",\"PS\"))","v":"PS"},{"$f":"IF(Таблица1[[#This Row],[Number]]=\"\",\"\",IF(OR(Таблица1[[#This Row],[Name]]=\"Bounty Builder\",Таблица1[[#This Row],[Name]]=\"Progressive KO\"),\"KO\",\"Friz\"))","v":"Friz"},{"$f":"IF(Таблица1[[#This Row],[Number]]=\"\",\"\",IF( Таблица1[[#This Row],[2]]=\"0:000,2545 maxps\",     \"Regular\",0))","v":"Regular"},{"$f":"IF(Таблица1[[#This Row],[Number]]=\"\",\"\",VLOOKUP(Таблица1[[#This Row],[Number]],Таблица2[],6,0))","v":9},{"$f":"IF(Таблица1[[#This Row],[Number]]=\"\",\"\",VLOOKUP(Таблица1[[#This Row],[Number]],Таблица2[],5,0))","v":45},{"$f":"IF(Таблица1[[#This Row],[Number]]=\"\",\"\",VLOOKUP(Таблица1[[#This Row],[Number]],Таблица2[],7,0))","v":0.25},null,null,{"$f":"IF(Таблица1[[#This Row],[Number]]=\"\",\"\",Таблица1[[#This Row],[Re-entry]]*Таблица1[[#This Row],[Buy-In]]+Таблица1[[#This Row],[Buy-In]]+Таблица1[[#This Row],[R/A]]*Таблица1[[#This Row],[Buy-In]])","v":0.25},{"$f":"IF(Таблица1[[#This Row],[Number]]=\"\",\"\",VLOOKUP(Таблица1[[#This Row],[Number]],Таблица2[],8,0))","v":38},{"$f":"IF(Таблица1[[#This Row],[Number]]=\"\",\"\",VLOOKUP(Таблица1[[#This Row],[Number]],Таблица2[],9,0))","v":0},{"$f":"IF(Таблица1[[#This Row],[Number]]=\"\",\"\",Таблица1[[#This Row],[Winnings]]-Таблица1[[#This Row],[Total Buy-In]])","v":-0.25},{"$f":"IF(Таблица1[[#This Row],[Number]]=\"\",\"\",VLOOKUP(Таблица1[[#This Row],[Number]],Таблица2[],11,0))","v":13},{"$f":"IF(Таблица1[[#This Row],[Number]]=\"\",\"\",VLOOKUP(Таблица1[[#This Row],[Number]],Таблица2[],12,0))","v":-563.33000000000004},{"$f":"IF(Таблица1[[#This Row],[Number]]=\"\",\"\",VLOOKUP(Таблица1[[#This Row],[Number]],Таблица2[],13,0))","v":-561.84},{"$f":"IF(Таблица1[[#This Row],[Number]]=\"\",\"\",Таблица1[[#This Row],[bb/100]]*Таблица1[[#This Row],[Total Hands]])","v":-7323.2900000000009},{"$f":"IF(Таблица1[[#This Row],[Number]]=\"\",\"\",Таблица1[[#This Row],[EV bb/100]]*Таблица1[[#This Row],[Total Hands]])","v":-7303.92},{"$f":"IF(Таблица1[[#This Row],[Number]]=\"\",\"\",CONCATENATE(TEXT(TIME(HOUR(J4),MINUTE(J4),0),\"h:mm\"),Таблица1[[#This Row],[Buy-In]],Таблица1[[#This Row],[Name]],Таблица1[[#This Row],[Room]]))","v":"0:000,2545 MaxPS"}]
[null,{"$f":"IF(Таблица1[[#This Row],[Number]]=\"\",\"\",CONCATENATE(TEXT(TIME(HOUR(J5),MINUTE(J5),0),\"[hh]:mm;@\"),\" \",Таблица1[[#This Row],[Buy-In]],\" \",Таблица1[[#This Row],[Name]],\" \",Таблица1[[#This Row],[Room]],\" \",Таблица1[[#This Row],[KO/Friz]],\"  \",Таблица1[[#This Row],[Speed]],\" \",Таблица1[[#This Row],[Table size]]))","v":"00:00 0,25 45 Max PS Friz  Regular 9"},{"$f":"IF(Таблица1[[#This Row],[Number]]=\"\",\"\",TEXT(Таблица1[[#This Row],[Date]],\"mmmm\"))","v":"июль"},{"$f":"IF(Таблица1[[#This Row],[Number]]=\"\",\"\",WEEKNUM(Таблица1[[#This Row],[Date]],2))","v":27},{"$f":"IF(Таблица1[[#This Row],[Number]]=\"\",\"\",CHOOSE(WEEKDAY(Таблица1[[#This Row],[Date]],2),\"понедельник\",\"вторник\",\"среда\",\"четверг\",\"пятница\",\"суббота\",\"воскресенье\"))","v":"понедельник"},{"$f":"IFERROR(INDEX(Таблица2[Number],MATCH(0,COUNTIF($F$3:F4,Таблица2[Number]),0)),\"\")","v":2640635094},{"$f":"IF(Таблица1[[#This Row],[Number]]=\"\",\"\",VLOOKUP(Таблица1[[#This Row],[Number]],Таблица2[],2,0))","v":"2019-07-01"},{"$f":"IF(Таблица1[[#This Row],[Number]]=\"\",\"\",VLOOKUP(Таблица1[[#This Row],[Number]],Таблица2[],3,0))","v":43647.391377314816},{"$f":"IF(Таблица1[[#This Row],[Number]]=\"\",\"\",VLOOKUP(Таблица1[[#This Row],[Number]],Таблица2[],4,0))","v":43647.44599537037},null,{"$f":"IF(OR(CONCATENATE(Таблица1[[#This Row],[Buy-In]],Таблица1[[#This Row],[Size]])  =\"0,2545\",  CONCATENATE(Таблица1[[#This Row],[Buy-In]],Таблица1[[#This Row],[Size]])  =\"0,545\", CONCATENATE(Таблица1[[#This Row],[Buy-In]],Таблица1[[#This Row],[Size]])  =\"145\"  ),    \"45 Max\", IF(OR(CONCATENATE(Таблица1[[#This Row],[Buy-In]],Таблица1[[#This Row],[Size]])  =\"1180\",  CONCATENATE(Таблица1[[#This Row],[Buy-In]],Таблица1[[#This Row],[Size]])  =\"1180\"), \"180 Max\",\"\")  )","v":"45 Max"},{"$f":"IF(Таблица1[[#This Row],[Number]]=\"\",\"\",IF(VLOOKUP(Таблица1[[#This Row],[Number]],Таблица2[],14,0)=\"mâro (PS)\",\"PS\"))","v":"PS"},{"$f":"IF(Таблица1[[#This Row],[Number]]=\"\",\"\",IF(OR(Таблица1[[#This Row],[Name]]=\"Bounty Builder\",Таблица1[[#This Row],[Name]]=\"Progressive KO\"),\"KO\",\"Friz\"))","v":"Friz"},{"$f":"IF(Таблица1[[#This Row],[Number]]=\"\",\"\",IF( Таблица1[[#This Row],[2]]=\"0:000,2545 maxps\",     \"Regular\",0))","v":"Regular"},{"$f":"IF(Таблица1[[#This Row],[Number]]=\"\",\"\",VLOOKUP(Таблица1[[#This Row],[Number]],Таблица2[],6,0))","v":9},{"$f":"IF(Таблица1[[#This Row],[Number]]=\"\",\"\",VLOOKUP(Таблица1[[#This Row],[Number]],Таблица2[],5,0))","v":45},{"$f":"IF(Таблица1[[#This Row],[Number]]=\"\",\"\",VLOOKUP(Таблица1[[#This Row],[Number]],Таблица2[],7,0))","v":0.25},null,null,{"$f":"IF(Таблица1[[#This Row],[Number]]=\"\",\"\",Таблица1[[#This Row],[Re-entry]]*Таблица1[[#This Row],[Buy-In]]+Таблица1[[#This Row],[Buy-In]]+Таблица1[[#This Row],[R/A]]*Таблица1[[#This Row],[Buy-In]])","v":0.25},{"$f":"IF(Таблица1[[#This Row],[Number]]=\"\",\"\",VLOOKUP(Таблица1[[#This Row],[Number]],Таблица2[],8,0))","v":11},{"$f":"IF(Таблица1[[#This Row],[Number]]=\"\",\"\",VLOOKUP(Таблица1[[#This Row],[Number]],Таблица2[],9,0))","v":0},{"$f":"IF(Таблица1[[#This Row],[Number]]=\"\",\"\",Таблица1[[#This Row],[Winnings]]-Таблица1[[#This Row],[Total Buy-In]])","v":-0.25},{"$f":"IF(Таблица1[[#This Row],[Number]]=\"\",\"\",VLOOKUP(Таблица1[[#This Row],[Number]],Таблица2[],11,0))","v":110},{"$f":"IF(Таблица1[[#This Row],[Number]]=\"\",\"\",VLOOKUP(Таблица1[[#This Row],[Number]],Таблица2[],12,0))","v":-18.41},{"$f":"IF(Таблица1[[#This Row],[Number]]=\"\",\"\",VLOOKUP(Таблица1[[#This Row],[Number]],Таблица2[],13,0))","v":-43.95},{"$f":"IF(Таблица1[[#This Row],[Number]]=\"\",\"\",Таблица1[[#This Row],[bb/100]]*Таблица1[[#This Row],[Total Hands]])","v":-2025.1},{"$f":"IF(Таблица1[[#This Row],[Number]]=\"\",\"\",Таблица1[[#This Row],[EV bb/100]]*Таблица1[[#This Row],[Total Hands]])","v":-4834.5},{"$f":"IF(Таблица1[[#This Row],[Number]]=\"\",\"\",CONCATENATE(TEXT(TIME(HOUR(J5),MINUTE(J5),0),\"h:mm\"),Таблица1[[#This Row],[Buy-In]],Таблица1[[#This Row],[Name]],Таблица1[[#This Row],[Room]]))","v":"0:000,2545 MaxPS"}]
[null,{"$f":"IF(Таблица1[[#This Row],[Number]]=\"\",\"\",CONCATENATE(TEXT(TIME(HOUR(J6),MINUTE(J6),0),\"[hh]:mm;@\"),\" \",Таблица1[[#This Row],[Buy-In]],\" \",Таблица1[[#This Row],[Name]],\" \",Таблица1[[#This Row],[Room]],\" \",Таблица1[[#This Row],[KO/Friz]],\"  \",Таблица1[[#This Row],[Speed]],\" \",Таблица1[[#This Row],[Table size]]))","v":"00:00 0,25 45 Max PS Friz  Regular 9"},{"$f":"IF(Таблица1[[#This Row],[Number]]=\"\",\"\",TEXT(Таблица1[[#This Row],[Date]],\"mmmm\"))","v":"июль"},{"$f":"IF(Таблица1[[#This Row],[Number]]=\"\",\"\",WEEKNUM(Таблица1[[#This Row],[Date]],2))","v":27},{"$f":"IF(Таблица1[[#This Row],[Number]]=\"\",\"\",CHOOSE(WEEKDAY(Таблица1[[#This Row],[Date]],2),\"понедельник\",\"вторник\",\"среда\",\"четверг\",\"пятница\",\"суббота\",\"воскресенье\"))","v":"понедельник"},{"$f":"IFERROR(INDEX(Таблица2[Number],MATCH(0,COUNTIF($F$3:F5,Таблица2[Number]),0)),\"\")","v":2640638091},{"$f":"IF(Таблица1[[#This Row],[Number]]=\"\",\"\",VLOOKUP(Таблица1[[#This Row],[Number]],Таблица2[],2,0))","v":"2019-07-01"},{"$f":"IF(Таблица1[[#This Row],[Number]]=\"\",\"\",VLOOKUP(Таблица1[[#This Row],[Number]],Таблица2[],3,0))","v":43647.396666666667},{"$f":"IF(Таблица1[[#This Row],[Number]]=\"\",\"\",VLOOKUP(Таблица1[[#This Row],[Number]],Таблица2[],4,0))","v":43647.411504629628},null,{"$f":"IF(OR(CONCATENATE(Таблица1[[#This Row],[Buy-In]],Таблица1[[#This Row],[Size]])  =\"0,2545\",  CONCATENATE(Таблица1[[#This Row],[Buy-In]],Таблица1[[#This Row],[Size]])  =\"0,545\", CONCATENATE(Таблица1[[#This Row],[Buy-In]],Таблица1[[#This Row],[Size]])  =\"145\"  ),    \"45 Max\", IF(OR(CONCATENATE(Таблица1[[#This Row],[Buy-In]],Таблица1[[#This Row],[Size]])  =\"1180\",  CONCATENATE(Таблица1[[#This Row],[Buy-In]],Таблица1[[#This Row],[Size]])  =\"1180\"), \"180 Max\",\"\")  )","v":"45 Max"},{"$f":"IF(Таблица1[[#This Row],[Number]]=\"\",\"\",IF(VLOOKUP(Таблица1[[#This Row],[Number]],Таблица2[],14,0)=\"mâro (PS)\",\"PS\"))","v":"PS"},{"$f":"IF(Таблица1[[#This Row],[Number]]=\"\",\"\",IF(OR(Таблица1[[#This Row],[Name]]=\"Bounty Builder\",Таблица1[[#This Row],[Name]]=\"Progressive KO\"),\"KO\",\"Friz\"))","v":"Friz"},{"$f":"IF(Таблица1[[#This Row],[Number]]=\"\",\"\",IF( Таблица1[[#This Row],[2]]=\"0:000,2545 maxps\",     \"Regular\",0))","v":"Regular"},{"$f":"IF(Таблица1[[#This Row],[Number]]=\"\",\"\",VLOOKUP(Таблица1[[#This Row],[Number]],Таблица2[],6,0))","v":9},{"$f":"IF(Таблица1[[#This Row],[Number]]=\"\",\"\",VLOOKUP(Таблица1[[#This Row],[Number]],Таблица2[],5,0))","v":45},{"$f":"IF(Таблица1[[#This Row],[Number]]=\"\",\"\",VLOOKUP(Таблица1[[#This Row],[Number]],Таблица2[],7,0))","v":0.25},null,null,{"$f":"IF(Таблица1[[#This Row],[Number]]=\"\",\"\",Таблица1[[#This Row],[Re-entry]]*Таблица1[[#This Row],[Buy-In]]+Таблица1[[#This Row],[Buy-In]]+Таблица1[[#This Row],[R/A]]*Таблица1[[#This Row],[Buy-In]])","v":0.25},{"$f":"IF(Таблица1[[#This Row],[Number]]=\"\",\"\",VLOOKUP(Таблица1[[#This Row],[Number]],Таблица2[],8,0))","v":31},{"$f":"IF(Таблица1[[#This Row],[Number]]=\"\",\"\",VLOOKUP(Таблица1[[#This Row],[Number]],Таблица2[],9,0))","v":0},{"$f":"IF(Таблица1[[#This Row],[Number]]=\"\",\"\",Таблица1[[#This Row],[Winnings]]-Таблица1[[#This Row],[Total Buy-In]])","v":-0.25},{"$f":"IF(Таблица1[[#This Row],[Number]]=\"\",\"\",VLOOKUP(Таблица1[[#This Row],[Number]],Таблица2[],11,0))","v":19},{"$f":"IF(Таблица1[[#This Row],[Number]]=\"\",\"\",VLOOKUP(Таблица1[[#This Row],[Number]],Таблица2[],12,0))","v":-153.93},{"$f":"IF(Таблица1[[#This Row],[Number]]=\"\",\"\",VLOOKUP(Таблица1[[#This Row],[Number]],Таблица2[],13,0))","v":253.05},{"$f":"IF(Таблица1[[#This Row],[Number]]=\"\",\"\",Таблица1[[#This Row],[bb/100]]*Таблица1[[#This Row],[Total Hands]])","v":-2924.67},{"$f":"IF(Таблица1[[#This Row],[Number]]=\"\",\"\",Таблица1[[#This Row],[EV bb/100]]*Таблица1[[#This Row],[Total Hands]])","v":4807.95},{"$f":"IF(Таблица1[[#This Row],[Number]]=\"\",\"\",CONCATENATE(TEXT(TIME(HOUR(J6),MINUTE(J6),0),\"h:mm\"),Таблица1[[#This Row],[Buy-In]],Таблица1[[#This Row],[Name]],Таблица1[[#This Row],[Room]]))","v":"0:000,2545 MaxPS"}]
[null,{"$f":"IF(Таблица1[[#This Row],[Number]]=\"\",\"\",CONCATENATE(TEXT(TIME(HOUR(J7),MINUTE(J7),0),\"[hh]:mm;@\"),\" \",Таблица1[[#This Row],[Buy-In]],\" \",Таблица1[[#This Row],[Name]],\" \",Таблица1[[#This Row],[Room]],\" \",Таблица1[[#This Row],[KO/Friz]],\"  \",Таблица1[[#This Row],[Speed]],\" \",Таблица1[[#This Row],[Table size]]))","v":"00:00 0,25 45 Max PS Friz  Regular 9"},{"$f":"IF(Таблица1[[#This Row],[Number]]=\"\",\"\",TEXT(Таблица1[[#This Row],[Date]],\"mmmm\"))","v":"июль"},{"$f":"IF(Таблица1[[#This Row],[Number]]=\"\",\"\",WEEKNUM(Таблица1[[#This Row],[Date]],2))","v":27},{"$f":"IF(Таблица1[[#This Row],[Number]]=\"\",\"\",CHOOSE(WEEKDAY(Таблица1[[#This Row],[Date]],2),\"понедельник\",\"вторник\",\"среда\",\"четверг\",\"пятница\",\"суббота\",\"воскресенье\"))","v":"понедельник"},{"$f":"IFERROR(INDEX(Таблица2[Number],MATCH(0,COUNTIF($F$3:F6,Таблица2[Number]),0)),\"\")","v":2640644187},{"$f":"IF(Таблица1[[#This Row],[Number]]=\"\",\"\",VLOOKUP(Таблица1[[#This Row],[Number]],Таблица2[],2,0))","v":"2019-07-01"},{"$f":"IF(Таблица1[[#This Row],[Number]]=\"\",\"\",VLOOKUP(Таблица1[[#This Row],[Number]],Таблица2[],3,0))","v":43647.416307870371},{"$f":"IF(Таблица1[[#This Row],[Number]]=\"\",\"\",VLOOKUP(Таблица1[[#This Row],[Number]],Таблица2[],4,0))","v":43647.513495370367},null,{"$f":"IF(OR(CONCATENATE(Таблица1[[#This Row],[Buy-In]],Таблица1[[#This Row],[Size]])  =\"0,2545\",  CONCATENATE(Таблица1[[#This Row],[Buy-In]],Таблица1[[#This Row],[Size]])  =\"0,545\", CONCATENATE(Таблица1[[#This Row],[Buy-In]],Таблица1[[#This Row],[Size]])  =\"145\"  ),    \"45 Max\", IF(OR(CONCATENATE(Таблица1[[#This Row],[Buy-In]],Таблица1[[#This Row],[Size]])  =\"1180\",  CONCATENATE(Таблица1[[#This Row],[Buy-In]],Таблица1[[#This Row],[Size]])  =\"1180\"), \"180 Max\",\"\")  )","v":"45 Max"},{"$f":"IF(Таблица1[[#This Row],[Number]]=\"\",\"\",IF(VLOOKUP(Таблица1[[#This Row],[Number]],Таблица2[],14,0)=\"mâro (PS)\",\"PS\"))","v":"PS"},{"$f":"IF(Таблица1[[#This Row],[Number]]=\"\",\"\",IF(OR(Таблица1[[#This Row],[Name]]=\"Bounty Builder\",Таблица1[[#This Row],[Name]]=\"Progressive KO\"),\"KO\",\"Friz\"))","v":"Friz"},{"$f":"IF(Таблица1[[#This Row],[Number]]=\"\",\"\",IF( Таблица1[[#This Row],[2]]=\"0:000,2545 maxps\",     \"Regular\",0))","v":"Regular"},{"$f":"IF(Таблица1[[#This Row],[Number]]=\"\",\"\",VLOOKUP(Таблица1[[#This Row],[Number]],Таблица2[],6,0))","v":9},{"$f":"IF(Таблица1[[#This Row],[Number]]=\"\",\"\",VLOOKUP(Таблица1[[#This Row],[Number]],Таблица2[],5,0))","v":45},{"$f":"IF(Таблица1[[#This Row],[Number]]=\"\",\"\",VLOOKUP(Таблица1[[#This Row],[Number]],Таблица2[],7,0))","v":0.25},null,null,{"$f":"IF(Таблица1[[#This Row],[Number]]=\"\",\"\",Таблица1[[#This Row],[Re-entry]]*Таблица1[[#This Row],[Buy-In]]+Таблица1[[#This Row],[Buy-In]]+Таблица1[[#This Row],[R/A]]*Таблица1[[#This Row],[Buy-In]])","v":0.25},{"$f":"IF(Таблица1[[#This Row],[Number]]=\"\",\"\",VLOOKUP(Таблица1[[#This Row],[Number]],Таблица2[],8,0))","v":1},{"$f":"IF(Таблица1[[#This Row],[Number]]=\"\",\"\",VLOOKUP(Таблица1[[#This Row],[Number]],Таблица2[],9,0))","v":3.23},{"$f":"IF(Таблица1[[#This Row],[Number]]=\"\",\"\",Таблица1[[#This Row],[Winnings]]-Таблица1[[#This Row],[Total Buy-In]])","v":2.98},{"$f":"IF(Таблица1[[#This Row],[Number]]=\"\",\"\",VLOOKUP(Таблица1[[#This Row],[Number]],Таблица2[],11,0))","v":274},{"$f":"IF(Таблица1[[#This Row],[Number]]=\"\",\"\",VLOOKUP(Таблица1[[#This Row],[Number]],Таблица2[],12,0))","v":73.12},{"$f":"IF(Таблица1[[#This Row],[Number]]=\"\",\"\",VLOOKUP(Таблица1[[#This Row],[Number]],Таблица2[],13,0))","v":35.85},{"$f":"IF(Таблица1[[#This Row],[Number]]=\"\",\"\",Таблица1[[#This Row],[bb/100]]*Таблица1[[#This Row],[Total Hands]])","v":20034.88},{"$f":"IF(Таблица1[[#This Row],[Number]]=\"\",\"\",Таблица1[[#This Row],[EV bb/100]]*Таблица1[[#This Row],[Total Hands]])","v":9822.9},{"$f":"IF(Таблица1[[#This Row],[Number]]=\"\",\"\",CONCATENATE(TEXT(TIME(HOUR(J7),MINUTE(J7),0),\"h:mm\"),Таблица1[[#This Row],[Buy-In]],Таблица1[[#This Row],[Name]],Таблица1[[#This Row],[Room]]))","v":"0:000,2545 MaxPS"}]

{"sheet":"день","index":4,"n_rows":64,"n_cols":12,"rows_kept":64,"cut":false,"hidden":false,"merged":[]}
[]
[null,"2019","Games","Buy-in","ABI","Roi","Itm","Hand","bb/100","EV bb/100","Profit","Pr/Game"]
[null,"2019-07-01",{"$f":"COUNTIFS(Таблица1[Date],Таблица6[[#This Row],[2019]])+SUMIFS(Таблица1[Re-entry],Таблица1[Date],Таблица6[[#This Row],[2019]])","v":4},{"$f":"SUMIFS(Таблица1[Total Buy-In],Таблица1[Date],Таблица6[[#This Row],[2019]])","v":1},{"$f":"IFERROR(Таблица6[Buy-in]/Таблица6[Games],0)","v":0.25},{"$f":"IFERROR((Таблица6[Profit]/Таблица6[Buy-in])*100,0)","v":223},{"$f":"IFERROR((COUNTIFS(Таблица1[Date],Таблица6[2019],Таблица1[Winnings],\">0\")/Таблица6[Games])*100,0)","v":25},{"$f":"SUMIFS(Таблица1[Total Hands],Таблица1[Date],Таблица6[[#This Row],[2019]])","v":416},{"$f":"IFERROR(SUMIFS(Таблица1[bb/101],Таблица1[Date],Таблица6[[#This Row],[2019]])/Таблица6[[#This Row],[Hand]],0)","v":18.658221153846153},{"$f":"IFERROR(SUMIFS(Таблица1[EV bb/101],Таблица1[Date],Таблица6[[#This Row],[2019]])/Таблица6[[#This Row],[Hand]],0)","v":5.9914182692307678},{"$f":"SUMIFS(Таблица1[Net Winnings],Таблица1[Date],Таблица6[2019])","v":2.23},{"$f":"IFERROR(Таблица6[[#This Row],[Profit]]/Таблица6[[#This Row],[Games]],0)","v":0.5575}]
[null,"2019-07-02",{"$f":"COUNTIFS(Таблица1[Date],Таблица6[[#This Row],[2019]])+SUMIFS(Таблица1[Re-entry],Таблица1[Date],Таблица6[[#This Row],[2019]])","v":0},{"$f":"SUMIFS(Таблица1[Total Buy-In],Таблица1[Date],Таблица6[[#This Row],[2019]])","v":0},{"$f":"IFERROR(Таблица6[Buy-in]/Таблица6[Games],0)","v":0},{"$f":"IFERROR((Таблица6[Profit]/Таблица6[Buy-in])*100,0)","v":0},{"$f":"IFERROR((COUNTIFS(Таблица1[Date],Таблица6[2019],Таблица1[Winnings],\">0\")/Таблица6[Games])*100,0)","v":0},{"$f":"SUMIFS(Таблица1[Total Hands],Таблица1[Date],Таблица6[[#This Row],[2019]])","v":0},{"$f":"IFERROR(SUMIFS(Таблица1[bb/101],Таблица1[Date],Таблица6[[#This Row],[2019]])/Таблица6[[#This Row],[Hand]],0)","v":0},{"$f":"IFERROR(SUMIFS(Таблица1[EV bb/101],Таблица1[Date],Таблица6[[#This Row],[2019]])/Таблица6[[#This Row],[Hand]],0)","v":0},{"$f":"SUMIFS(Таблица1[Net Winnings],Таблица1[Date],Таблица6[2019])","v":0},{"$f":"IFERROR(Таблица6[[#This Row],[Profit]]/Таблица6[[#This Row],[Games]],0)","v":0}]
[null,"2019-07-03",{"$f":"COUNTIFS(Таблица1[Date],Таблица6[[#This Row],[2019]])+SUMIFS(Таблица1[Re-entry],Таблица1[Date],Таблица6[[#This Row],[2019]])","v":0},{"$f":"SUMIFS(Таблица1[Total Buy-In],Таблица1[Date],Таблица6[[#This Row],[2019]])","v":0},{"$f":"IFERROR(Таблица6[Buy-in]/Таблица6[Games],0)","v":0},{"$f":"IFERROR((Таблица6[Profit]/Таблица6[Buy-in])*100,0)","v":0},{"$f":"IFERROR((COUNTIFS(Таблица1[Date],Таблица6[2019],Таблица1[Winnings],\">0\")/Таблица6[Games])*100,0)","v":0},{"$f":"SUMIFS(Таблица1[Total Hands],Таблица1[Date],Таблица6[[#This Row],[2019]])","v":0},{"$f":"IFERROR(SUMIFS(Таблица1[bb/101],Таблица1[Date],Таблица6[[#This Row],[2019]])/Таблица6[[#This Row],[Hand]],0)","v":0},{"$f":"IFERROR(SUMIFS(Таблица1[EV bb/101],Таблица1[Date],Таблица6[[#This Row],[2019]])/Таблица6[[#This Row],[Hand]],0)","v":0},{"$f":"SUMIFS(Таблица1[Net Winnings],Таблица1[Date],Таблица6[2019])","v":0},{"$f":"IFERROR(Таблица6[[#This Row],[Profit]]/Таблица6[[#This Row],[Games]],0)","v":0}]
[null,"2019-07-04",{"$f":"COUNTIFS(Таблица1[Date],Таблица6[[#This Row],[2019]])+SUMIFS(Таблица1[Re-entry],Таблица1[Date],Таблица6[[#This Row],[2019]])","v":0},{"$f":"SUMIFS(Таблица1[Total Buy-In],Таблица1[Date],Таблица6[[#This Row],[2019]])","v":0},{"$f":"IFERROR(Таблица6[Buy-in]/Таблица6[Games],0)","v":0},{"$f":"IFERROR((Таблица6[Profit]/Таблица6[Buy-in])*100,0)","v":0},{"$f":"IFERROR((COUNTIFS(Таблица1[Date],Таблица6[2019],Таблица1[Winnings],\">0\")/Таблица6[Games])*100,0)","v":0},{"$f":"SUMIFS(Таблица1[Total Hands],Таблица1[Date],Таблица6[[#This Row],[2019]])","v":0},{"$f":"IFERROR(SUMIFS(Таблица1[bb/101],Таблица1[Date],Таблица6[[#This Row],[2019]])/Таблица6[[#This Row],[Hand]],0)","v":0},{"$f":"IFERROR(SUMIFS(Таблица1[EV bb/101],Таблица1[Date],Таблица6[[#This Row],[2019]])/Таблица6[[#This Row],[Hand]],0)","v":0},{"$f":"SUMIFS(Таблица1[Net Winnings],Таблица1[Date],Таблица6[2019])","v":0},{"$f":"IFERROR(Таблица6[[#This Row],[Profit]]/Таблица6[[#This Row],[Games]],0)","v":0}]
[null,"2019-07-05",{"$f":"COUNTIFS(Таблица1[Date],Таблица6[[#This Row],[2019]])+SUMIFS(Таблица1[Re-entry],Таблица1[Date],Таблица6[[#This Row],[2019]])","v":0},{"$f":"SUMIFS(Таблица1[Total Buy-In],Таблица1[Date],Таблица6[[#This Row],[2019]])","v":0},{"$f":"IFERROR(Таблица6[Buy-in]/Таблица6[Games],0)","v":0},{"$f":"IFERROR((Таблица6[Profit]/Таблица6[Buy-in])*100,0)","v":0},{"$f":"IFERROR((COUNTIFS(Таблица1[Date],Таблица6[2019],Таблица1[Winnings],\">0\")/Таблица6[Games])*100,0)","v":0},{"$f":"SUMIFS(Таблица1[Total Hands],Таблица1[Date],Таблица6[[#This Row],[2019]])","v":0},{"$f":"IFERROR(SUMIFS(Таблица1[bb/101],Таблица1[Date],Таблица6[[#This Row],[2019]])/Таблица6[[#This Row],[Hand]],0)","v":0},{"$f":"IFERROR(SUMIFS(Таблица1[EV bb/101],Таблица1[Date],Таблица6[[#This Row],[2019]])/Таблица6[[#This Row],[Hand]],0)","v":0},{"$f":"SUMIFS(Таблица1[Net Winnings],Таблица1[Date],Таблица6[2019])","v":0},{"$f":"IFERROR(Таблица6[[#This Row],[Profit]]/Таблица6[[#This Row],[Games]],0)","v":0}]
[null,"2019-07-06",{"$f":"COUNTIFS(Таблица1[Date],Таблица6[[#This Row],[2019]])+SUMIFS(Таблица1[Re-entry],Таблица1[Date],Таблица6[[#This Row],[2019]])","v":0},{"$f":"SUMIFS(Таблица1[Total Buy-In],Таблица1[Date],Таблица6[[#This Row],[2019]])","v":0},{"$f":"IFERROR(Таблица6[Buy-in]/Таблица6[Games],0)","v":0},{"$f":"IFERROR((Таблица6[Profit]/Таблица6[Buy-in])*100,0)","v":0},{"$f":"IFERROR((COUNTIFS(Таблица1[Date],Таблица6[2019],Таблица1[Winnings],\">0\")/Таблица6[Games])*100,0)","v":0},{"$f":"SUMIFS(Таблица1[Total Hands],Таблица1[Date],Таблица6[[#This Row],[2019]])","v":0},{"$f":"IFERROR(SUMIFS(Таблица1[bb/101],Таблица1[Date],Таблица6[[#This Row],[2019]])/Таблица6[[#This Row],[Hand]],0)","v":0},{"$f":"IFERROR(SUMIFS(Таблица1[EV bb/101],Таблица1[Date],Таблица6[[#This Row],[2019]])/Таблица6[[#This Row],[Hand]],0)","v":0},{"$f":"SUMIFS(Таблица1[Net Winnings],Таблица1[Date],Таблица6[2019])","v":0},{"$f":"IFERROR(Таблица6[[#This Row],[Profit]]/Таблица6[[#This Row],[Games]],0)","v":0}]
[null,"2019-07-07",{"$f":"COUNTIFS(Таблица1[Date],Таблица6[[#This Row],[2019]])+SUMIFS(Таблица1[Re-entry],Таблица1[Date],Таблица6[[#This Row],[2019]])","v":0},{"$f":"SUMIFS(Таблица1[Total Buy-In],Таблица1[Date],Таблица6[[#This Row],[2019]])","v":0},{"$f":"IFERROR(Таблица6[Buy-in]/Таблица6[Games],0)","v":0},{"$f":"IFERROR((Таблица6[Profit]/Таблица6[Buy-in])*100,0)","v":0},{"$f":"IFERROR((COUNTIFS(Таблица1[Date],Таблица6[2019],Таблица1[Winnings],\">0\")/Таблица6[Games])*100,0)","v":0},{"$f":"SUMIFS(Таблица1[Total Hands],Таблица1[Date],Таблица6[[#This Row],[2019]])","v":0},{"$f":"IFERROR(SUMIFS(Таблица1[bb/101],Таблица1[Date],Таблица6[[#This Row],[2019]])/Таблица6[[#This Row],[Hand]],0)","v":0},{"$f":"IFERROR(SUMIFS(Таблица1[EV bb/101],Таблица1[Date],Таблица6[[#This Row],[2019]])/Таблица6[[#This Row],[Hand]],0)","v":0},{"$f":"SUMIFS(Таблица1[Net Winnings],Таблица1[Date],Таблица6[2019])","v":0},{"$f":"IFERROR(Таблица6[[#This Row],[Profit]]/Таблица6[[#This Row],[Games]],0)","v":0}]
[null,"2019-07-08",{"$f":"COUNTIFS(Таблица1[Date],Таблица6[[#This Row],[2019]])+SUMIFS(Таблица1[Re-entry],Таблица1[Date],Таблица6[[#This Row],[2019]])","v":0},{"$f":"SUMIFS(Таблица1[Total Buy-In],Таблица1[Date],Таблица6[[#This Row],[2019]])","v":0},{"$f":"IFERROR(Таблица6[Buy-in]/Таблица6[Games],0)","v":0},{"$f":"IFERROR((Таблица6[Profit]/Таблица6[Buy-in])*100,0)","v":0},{"$f":"IFERROR((COUNTIFS(Таблица1[Date],Таблица6[2019],Таблица1[Winnings],\">0\")/Таблица6[Games])*100,0)","v":0},{"$f":"SUMIFS(Таблица1[Total Hands],Таблица1[Date],Таблица6[[#This Row],[2019]])","v":0},{"$f":"IFERROR(SUMIFS(Таблица1[bb/101],Таблица1[Date],Таблица6[[#This Row],[2019]])/Таблица6[[#This Row],[Hand]],0)","v":0},{"$f":"IFERROR(SUMIFS(Таблица1[EV bb/101],Таблица1[Date],Таблица6[[#This Row],[2019]])/Таблица6[[#This Row],[Hand]],0)","v":0},{"$f":"SUMIFS(Таблица1[Net Winnings],Таблица1[Date],Таблица6[2019])","v":0},{"$f":"IFERROR(Таблица6[[#This Row],[Profit]]/Таблица6[[#This Row],[Games]],0)","v":0}]
[null,"2019-07-09",{"$f":"COUNTIFS(Таблица1[Date],Таблица6[[#This Row],[2019]])+SUMIFS(Таблица1[Re-entry],Таблица1[Date],Таблица6[[#This Row],[2019]])","v":0},{"$f":"SUMIFS(Таблица1[Total Buy-In],Таблица1[Date],Таблица6[[#This Row],[2019]])","v":0},{"$f":"IFERROR(Таблица6[Buy-in]/Таблица6[Games],0)","v":0},{"$f":"IFERROR((Таблица6[Profit]/Таблица6[Buy-in])*100,0)","v":0},{"$f":"IFERROR((COUNTIFS(Таблица1[Date],Таблица6[2019],Таблица1[Winnings],\">0\")/Таблица6[Games])*100,0)","v":0},{"$f":"SUMIFS(Таблица1[Total Hands],Таблица1[Date],Таблица6[[#This Row],[2019]])","v":0},{"$f":"IFERROR(SUMIFS(Таблица1[bb/101],Таблица1[Date],Таблица6[[#This Row],[2019]])/Таблица6[[#This Row],[Hand]],0)","v":0},{"$f":"IFERROR(SUMIFS(Таблица1[EV bb/101],Таблица1[Date],Таблица6[[#This Row],[2019]])/Таблица6[[#This Row],[Hand]],0)","v":0},{"$f":"SUMIFS(Таблица1[Net Winnings],Таблица1[Date],Таблица6[2019])","v":0},{"$f":"IFERROR(Таблица6[[#This Row],[Profit]]/Таблица6[[#This Row],[Games]],0)","v":0}]
[null,"2019-07-10",{"$f":"COUNTIFS(Таблица1[Date],Таблица6[[#This Row],[2019]])+SUMIFS(Таблица1[Re-entry],Таблица1[Date],Таблица6[[#This Row],[2019]])","v":0},{"$f":"SUMIFS(Таблица1[Total Buy-In],Таблица1[Date],Таблица6[[#This Row],[2019]])","v":0},{"$f":"IFERROR(Таблица6[Buy-in]/Таблица6[Games],0)","v":0},{"$f":"IFERROR((Таблица6[Profit]/Таблица6[Buy-in])*100,0)","v":0},{"$f":"IFERROR((COUNTIFS(Таблица1[Date],Таблица6[2019],Таблица1[Winnings],\">0\")/Таблица6[Games])*100,0)","v":0},{"$f":"SUMIFS(Таблица1[Total Hands],Таблица1[Date],Таблица6[[#This Row],[2019]])","v":0},{"$f":"IFERROR(SUMIFS(Таблица1[bb/101],Таблица1[Date],Таблица6[[#This Row],[2019]])/Таблица6[[#This Row],[Hand]],0)","v":0},{"$f":"IFERROR(SUMIFS(Таблица1[EV bb/101],Таблица1[Date],Таблица6[[#This Row],[2019]])/Таблица6[[#This Row],[Hand]],0)","v":0},{"$f":"SUMIFS(Таблица1[Net Winnings],Таблица1[Date],Таблица6[2019])","v":0},{"$f":"IFERROR(Таблица6[[#This Row],[Profit]]/Таблица6[[#This Row],[Games]],0)","v":0}]
[null,"2019-07-11",{"$f":"COUNTIFS(Таблица1[Date],Таблица6[[#This Row],[2019]])+SUMIFS(Таблица1[Re-entry],Таблица1[Date],Таблица6[[#This Row],[2019]])","v":0},{"$f":"SUMIFS(Таблица1[Total Buy-In],Таблица1[Date],Таблица6[[#This Row],[2019]])","v":0},{"$f":"IFERROR(Таблица6[Buy-in]/Таблица6[Games],0)","v":0},{"$f":"IFERROR((Таблица6[Profit]/Таблица6[Buy-in])*100,0)","v":0},{"$f":"IFERROR((COUNTIFS(Таблица1[Date],Таблица6[2019],Таблица1[Winnings],\">0\")/Таблица6[Games])*100,0)","v":0},{"$f":"SUMIFS(Таблица1[Total Hands],Таблица1[Date],Таблица6[[#This Row],[2019]])","v":0},{"$f":"IFERROR(SUMIFS(Таблица1[bb/101],Таблица1[Date],Таблица6[[#This Row],[2019]])/Таблица6[[#This Row],[Hand]],0)","v":0},{"$f":"IFERROR(SUMIFS(Таблица1[EV bb/101],Таблица1[Date],Таблица6[[#This Row],[2019]])/Таблица6[[#This Row],[Hand]],0)","v":0},{"$f":"SUMIFS(Таблица1[Net Winnings],Таблица1[Date],Таблица6[2019])","v":0},{"$f":"IFERROR(Таблица6[[#This Row],[Profit]]/Таблица6[[#This Row],[Games]],0)","v":0}]
[null,"2019-07-12",{"$f":"COUNTIFS(Таблица1[Date],Таблица6[[#This Row],[2019]])+SUMIFS(Таблица1[Re-entry],Таблица1[Date],Таблица6[[#This Row],[2019]])","v":0},{"$f":"SUMIFS(Таблица1[Total Buy-In],Таблица1[Date],Таблица6[[#This Row],[2019]])","v":0},{"$f":"IFERROR(Таблица6[Buy-in]/Таблица6[Games],0)","v":0},{"$f":"IFERROR((Таблица6[Profit]/Таблица6[Buy-in])*100,0)","v":0},{"$f":"IFERROR((COUNTIFS(Таблица1[Date],Таблица6[2019],Таблица1[Winnings],\">0\")/Таблица6[Games])*100,0)","v":0},{"$f":"SUMIFS(Таблица1[Total Hands],Таблица1[Date],Таблица6[[#This Row],[2019]])","v":0},{"$f":"IFERROR(SUMIFS(Таблица1[bb/101],Таблица1[Date],Таблица6[[#This Row],[2019]])/Таблица6[[#This Row],[Hand]],0)","v":0},{"$f":"IFERROR(SUMIFS(Таблица1[EV bb/101],Таблица1[Date],Таблица6[[#This Row],[2019]])/Таблица6[[#This Row],[Hand]],0)","v":0},{"$f":"SUMIFS(Таблица1[Net Winnings],Таблица1[Date],Таблица6[2019])","v":0},{"$f":"IFERROR(Таблица6[[#This Row],[Profit]]/Таблица6[[#This Row],[Games]],0)","v":0}]
[null,"2019-07-13",{"$f":"COUNTIFS(Таблица1[Date],Таблица6[[#This Row],[2019]])+SUMIFS(Таблица1[Re-entry],Таблица1[Date],Таблица6[[#This Row],[2019]])","v":0},{"$f":"SUMIFS(Таблица1[Total Buy-In],Таблица1[Date],Таблица6[[#This Row],[2019]])","v":0},{"$f":"IFERROR(Таблица6[Buy-in]/Таблица6[Games],0)","v":0},{"$f":"IFERROR((Таблица6[Profit]/Таблица6[Buy-in])*100,0)","v":0},{"$f":"IFERROR((COUNTIFS(Таблица1[Date],Таблица6[2019],Таблица1[Winnings],\">0\")/Таблица6[Games])*100,0)","v":0},{"$f":"SUMIFS(Таблица1[Total Hands],Таблица1[Date],Таблица6[[#This Row],[2019]])","v":0},{"$f":"IFERROR(SUMIFS(Таблица1[bb/101],Таблица1[Date],Таблица6[[#This Row],[2019]])/Таблица6[[#This Row],[Hand]],0)","v":0},{"$f":"IFERROR(SUMIFS(Таблица1[EV bb/101],Таблица1[Date],Таблица6[[#This Row],[2019]])/Таблица6[[#This Row],[Hand]],0)","v":0},{"$f":"SUMIFS(Таблица1[Net Winnings],Таблица1[Date],Таблица6[2019])","v":0},{"$f":"IFERROR(Таблица6[[#This Row],[Profit]]/Таблица6[[#This Row],[Games]],0)","v":0}]
[null,"2019-07-14",{"$f":"COUNTIFS(Таблица1[Date],Таблица6[[#This Row],[2019]])+SUMIFS(Таблица1[Re-entry],Таблица1[Date],Таблица6[[#This Row],[2019]])","v":0},{"$f":"SUMIFS(Таблица1[Total Buy-In],Таблица1[Date],Таблица6[[#This Row],[2019]])","v":0},{"$f":"IFERROR(Таблица6[Buy-in]/Таблица6[Games],0)","v":0},{"$f":"IFERROR((Таблица6[Profit]/Таблица6[Buy-in])*100,0)","v":0},{"$f":"IFERROR((COUNTIFS(Таблица1[Date],Таблица6[2019],Таблица1[Winnings],\">0\")/Таблица6[Games])*100,0)","v":0},{"$f":"SUMIFS(Таблица1[Total Hands],Таблица1[Date],Таблица6[[#This Row],[2019]])","v":0},{"$f":"IFERROR(SUMIFS(Таблица1[bb/101],Таблица1[Date],Таблица6[[#This Row],[2019]])/Таблица6[[#This Row],[Hand]],0)","v":0},{"$f":"IFERROR(SUMIFS(Таблица1[EV bb/101],Таблица1[Date],Таблица6[[#This Row],[2019]])/Таблица6[[#This Row],[Hand]],0)","v":0},{"$f":"SUMIFS(Таблица1[Net Winnings],Таблица1[Date],Таблица6[2019])","v":0},{"$f":"IFERROR(Таблица6[[#This Row],[Profit]]/Таблица6[[#This Row],[Games]],0)","v":0}]
[null,"2019-07-15",{"$f":"COUNTIFS(Таблица1[Date],Таблица6[[#This Row],[2019]])+SUMIFS(Таблица1[Re-entry],Таблица1[Date],Таблица6[[#This Row],[2019]])","v":0},{"$f":"SUMIFS(Таблица1[Total Buy-In],Таблица1[Date],Таблица6[[#This Row],[2019]])","v":0},{"$f":"IFERROR(Таблица6[Buy-in]/Таблица6[Games],0)","v":0},{"$f":"IFERROR((Таблица6[Profit]/Таблица6[Buy-in])*100,0)","v":0},{"$f":"IFERROR((COUNTIFS(Таблица1[Date],Таблица6[2019],Таблица1[Winnings],\">0\")/Таблица6[Games])*100,0)","v":0},{"$f":"SUMIFS(Таблица1[Total Hands],Таблица1[Date],Таблица6[[#This Row],[2019]])","v":0},{"$f":"IFERROR(SUMIFS(Таблица1[bb/101],Таблица1[Date],Таблица6[[#This Row],[2019]])/Таблица6[[#This Row],[Hand]],0)","v":0},{"$f":"IFERROR(SUMIFS(Таблица1[EV bb/101],Таблица1[Date],Таблица6[[#This Row],[2019]])/Таблица6[[#This Row],[Hand]],0)","v":0},{"$f":"SUMIFS(Таблица1[Net Winnings],Таблица1[Date],Таблица6[2019])","v":0},{"$f":"IFERROR(Таблица6[[#This Row],[Profit]]/Таблица6[[#This Row],[Games]],0)","v":0}]
[null,"2019-07-16",{"$f":"COUNTIFS(Таблица1[Date],Таблица6[[#This Row],[2019]])+SUMIFS(Таблица1[Re-entry],Таблица1[Date],Таблица6[[#This Row],[2019]])","v":0},{"$f":"SUMIFS(Таблица1[Total Buy-In],Таблица1[Date],Таблица6[[#This Row],[2019]])","v":0},{"$f":"IFERROR(Таблица6[Buy-in]/Таблица6[Games],0)","v":0},{"$f":"IFERROR((Таблица6[Profit]/Таблица6[Buy-in])*100,0)","v":0},{"$f":"IFERROR((COUNTIFS(Таблица1[Date],Таблица6[2019],Таблица1[Winnings],\">0\")/Таблица6[Games])*100,0)","v":0},{"$f":"SUMIFS(Таблица1[Total Hands],Таблица1[Date],Таблица6[[#This Row],[2019]])","v":0},{"$f":"IFERROR(SUMIFS(Таблица1[bb/101],Таблица1[Date],Таблица6[[#This Row],[2019]])/Таблица6[[#This Row],[Hand]],0)","v":0},{"$f":"IFERROR(SUMIFS(Таблица1[EV bb/101],Таблица1[Date],Таблица6[[#This Row],[2019]])/Таблица6[[#This Row],[Hand]],0)","v":0},{"$f":"SUMIFS(Таблица1[Net Winnings],Таблица1[Date],Таблица6[2019])","v":0},{"$f":"IFERROR(Таблица6[[#This Row],[Profit]]/Таблица6[[#This Row],[Games]],0)","v":0}]
[null,"2019-07-17",{"$f":"COUNTIFS(Таблица1[Date],Таблица6[[#This Row],[2019]])+SUMIFS(Таблица1[Re-entry],Таблица1[Date],Таблица6[[#This Row],[2019]])","v":0},{"$f":"SUMIFS(Таблица1[Total Buy-In],Таблица1[Date],Таблица6[[#This Row],[2019]])","v":0},{"$f":"IFERROR(Таблица6[Buy-in]/Таблица6[Games],0)","v":0},{"$f":"IFERROR((Таблица6[Profit]/Таблица6[Buy-in])*100,0)","v":0},{"$f":"IFERROR((COUNTIFS(Таблица1[Date],Таблица6[2019],Таблица1[Winnings],\">0\")/Таблица6[Games])*100,0)","v":0},{"$f":"SUMIFS(Таблица1[Total Hands],Таблица1[Date],Таблица6[[#This Row],[2019]])","v":0},{"$f":"IFERROR(SUMIFS(Таблица1[bb/101],Таблица1[Date],Таблица6[[#This Row],[2019]])/Таблица6[[#This Row],[Hand]],0)","v":0},{"$f":"IFERROR(SUMIFS(Таблица1[EV bb/101],Таблица1[Date],Таблица6[[#This Row],[2019]])/Таблица6[[#This Row],[Hand]],0)","v":0},{"$f":"SUMIFS(Таблица1[Net Winnings],Таблица1[Date],Таблица6[2019])","v":0},{"$f":"IFERROR(Таблица6[[#This Row],[Profit]]/Таблица6[[#This Row],[Games]],0)","v":0}]
[null,"2019-07-18",{"$f":"COUNTIFS(Таблица1[Date],Таблица6[[#This Row],[2019]])+SUMIFS(Таблица1[Re-entry],Таблица1[Date],Таблица6[[#This Row],[2019]])","v":0},{"$f":"SUMIFS(Таблица1[Total Buy-In],Таблица1[Date],Таблица6[[#This Row],[2019]])","v":0},{"$f":"IFERROR(Таблица6[Buy-in]/Таблица6[Games],0)","v":0},{"$f":"IFERROR((Таблица6[Profit]/Таблица6[Buy-in])*100,0)","v":0},{"$f":"IFERROR((COUNTIFS(Таблица1[Date],Таблица6[2019],Таблица1[Winnings],\">0\")/Таблица6[Games])*100,0)","v":0},{"$f":"SUMIFS(Таблица1[Total Hands],Таблица1[Date],Таблица6[[#This Row],[2019]])","v":0},{"$f":"IFERROR(SUMIFS(Таблица1[bb/101],Таблица1[Date],Таблица6[[#This Row],[2019]])/Таблица6[[#This Row],[Hand]],0)","v":0},{"$f":"IFERROR(SUMIFS(Таблица1[EV bb/101],Таблица1[Date],Таблица6[[#This Row],[2019]])/Таблица6[[#This Row],[Hand]],0)","v":0},{"$f":"SUMIFS(Таблица1[Net Winnings],Таблица1[Date],Таблица6[2019])","v":0},{"$f":"IFERROR(Таблица6[[#This Row],[Profit]]/Таблица6[[#This Row],[Games]],0)","v":0}]
[null,"2019-07-19",{"$f":"COUNTIFS(Таблица1[Date],Таблица6[[#This Row],[2019]])+SUMIFS(Таблица1[Re-entry],Таблица1[Date],Таблица6[[#This Row],[2019]])","v":0},{"$f":"SUMIFS(Таблица1[Total Buy-In],Таблица1[Date],Таблица6[[#This Row],[2019]])","v":0},{"$f":"IFERROR(Таблица6[Buy-in]/Таблица6[Games],0)","v":0},{"$f":"IFERROR((Таблица6[Profit]/Таблица6[Buy-in])*100,0)","v":0},{"$f":"IFERROR((COUNTIFS(Таблица1[Date],Таблица6[2019],Таблица1[Winnings],\">0\")/Таблица6[Games])*100,0)","v":0},{"$f":"SUMIFS(Таблица1[Total Hands],Таблица1[Date],Таблица6[[#This Row],[2019]])","v":0},{"$f":"IFERROR(SUMIFS(Таблица1[bb/101],Таблица1[Date],Таблица6[[#This Row],[2019]])/Таблица6[[#This Row],[Hand]],0)","v":0},{"$f":"IFERROR(SUMIFS(Таблица1[EV bb/101],Таблица1[Date],Таблица6[[#This Row],[2019]])/Таблица6[[#This Row],[Hand]],0)","v":0},{"$f":"SUMIFS(Таблица1[Net Winnings],Таблица1[Date],Таблица6[2019])","v":0},{"$f":"IFERROR(Таблица6[[#This Row],[Profit]]/Таблица6[[#This Row],[Games]],0)","v":0}]
[null,"2019-07-20",{"$f":"COUNTIFS(Таблица1[Date],Таблица6[[#This Row],[2019]])+SUMIFS(Таблица1[Re-entry],Таблица1[Date],Таблица6[[#This Row],[2019]])","v":0},{"$f":"SUMIFS(Таблица1[Total Buy-In],Таблица1[Date],Таблица6[[#This Row],[2019]])","v":0},{"$f":"IFERROR(Таблица6[Buy-in]/Таблица6[Games],0)","v":0},{"$f":"IFERROR((Таблица6[Profit]/Таблица6[Buy-in])*100,0)","v":0},{"$f":"IFERROR((COUNTIFS(Таблица1[Date],Таблица6[2019],Таблица1[Winnings],\">0\")/Таблица6[Games])*100,0)","v":0},{"$f":"SUMIFS(Таблица1[Total Hands],Таблица1[Date],Таблица6[[#This Row],[2019]])","v":0},{"$f":"IFERROR(SUMIFS(Таблица1[bb/101],Таблица1[Date],Таблица6[[#This Row],[2019]])/Таблица6[[#This Row],[Hand]],0)","v":0},{"$f":"IFERROR(SUMIFS(Таблица1[EV bb/101],Таблица1[Date],Таблица6[[#This Row],[2019]])/Таблица6[[#This Row],[Hand]],0)","v":0},{"$f":"SUMIFS(Таблица1[Net Winnings],Таблица1[Date],Таблица6[2019])","v":0},{"$f":"IFERROR(Таблица6[[#This Row],[Profit]]/Таблица6[[#This Row],[Games]],0)","v":0}]
[null,"2019-07-21",{"$f":"COUNTIFS(Таблица1[Date],Таблица6[[#This Row],[2019]])+SUMIFS(Таблица1[Re-entry],Таблица1[Date],Таблица6[[#This Row],[2019]])","v":0},{"$f":"SUMIFS(Таблица1[Total Buy-In],Таблица1[Date],Таблица6[[#This Row],[2019]])","v":0},{"$f":"IFERROR(Таблица6[Buy-in]/Таблица6[Games],0)","v":0},{"$f":"IFERROR((Таблица6[Profit]/Таблица6[Buy-in])*100,0)","v":0},{"$f":"IFERROR((COUNTIFS(Таблица1[Date],Таблица6[2019],Таблица1[Winnings],\">0\")/Таблица6[Games])*100,0)","v":0},{"$f":"SUMIFS(Таблица1[Total Hands],Таблица1[Date],Таблица6[[#This Row],[2019]])","v":0},{"$f":"IFERROR(SUMIFS(Таблица1[bb/101],Таблица1[Date],Таблица6[[#This Row],[2019]])/Таблица6[[#This Row],[Hand]],0)","v":0},{"$f":"IFERROR(SUMIFS(Таблица1[EV bb/101],Таблица1[Date],Таблица6[[#This Row],[2019]])/Таблица6[[#This Row],[Hand]],0)","v":0},{"$f":"SUMIFS(Таблица1[Net Winnings],Таблица1[Date],Таблица6[2019])","v":0},{"$f":"IFERROR(Таблица6[[#This Row],[Profit]]/Таблица6[[#This Row],[Games]],0)","v":0}]
[null,"2019-07-22",{"$f":"COUNTIFS(Таблица1[Date],Таблица6[[#This Row],[2019]])+SUMIFS(Таблица1[Re-entry],Таблица1[Date],Таблица6[[#This Row],[2019]])","v":0},{"$f":"SUMIFS(Таблица1[Total Buy-In],Таблица1[Date],Таблица6[[#This Row],[2019]])","v":0},{"$f":"IFERROR(Таблица6[Buy-in]/Таблица6[Games],0)","v":0},{"$f":"IFERROR((Таблица6[Profit]/Таблица6[Buy-in])*100,0)","v":0},{"$f":"IFERROR((COUNTIFS(Таблица1[Date],Таблица6[2019],Таблица1[Winnings],\">0\")/Таблица6[Games])*100,0)","v":0},{"$f":"SUMIFS(Таблица1[Total Hands],Таблица1[Date],Таблица6[[#This Row],[2019]])","v":0},{"$f":"IFERROR(SUMIFS(Таблица1[bb/101],Таблица1[Date],Таблица6[[#This Row],[2019]])/Таблица6[[#This Row],[Hand]],0)","v":0},{"$f":"IFERROR(SUMIFS(Таблица1[EV bb/101],Таблица1[Date],Таблица6[[#This Row],[2019]])/Таблица6[[#This Row],[Hand]],0)","v":0},{"$f":"SUMIFS(Таблица1[Net Winnings],Таблица1[Date],Таблица6[2019])","v":0},{"$f":"IFERROR(Таблица6[[#This Row],[Profit]]/Таблица6[[#This Row],[Games]],0)","v":0}]
[null,"2019-07-23",{"$f":"COUNTIFS(Таблица1[Date],Таблица6[[#This Row],[2019]])+SUMIFS(Таблица1[Re-entry],Таблица1[Date],Таблица6[[#This Row],[2019]])","v":0},{"$f":"SUMIFS(Таблица1[Total Buy-In],Таблица1[Date],Таблица6[[#This Row],[2019]])","v":0},{"$f":"IFERROR(Таблица6[Buy-in]/Таблица6[Games],0)","v":0},{"$f":"IFERROR((Таблица6[Profit]/Таблица6[Buy-in])*100,0)","v":0},{"$f":"IFERROR((COUNTIFS(Таблица1[Date],Таблица6[2019],Таблица1[Winnings],\">0\")/Таблица6[Games])*100,0)","v":0},{"$f":"SUMIFS(Таблица1[Total Hands],Таблица1[Date],Таблица6[[#This Row],[2019]])","v":0},{"$f":"IFERROR(SUMIFS(Таблица1[bb/101],Таблица1[Date],Таблица6[[#This Row],[2019]])/Таблица6[[#This Row],[Hand]],0)","v":0},{"$f":"IFERROR(SUMIFS(Таблица1[EV bb/101],Таблица1[Date],Таблица6[[#This Row],[2019]])/Таблица6[[#This Row],[Hand]],0)","v":0},{"$f":"SUMIFS(Таблица1[Net Winnings],Таблица1[Date],Таблица6[2019])","v":0},{"$f":"IFERROR(Таблица6[[#This Row],[Profit]]/Таблица6[[#This Row],[Games]],0)","v":0}]
[null,"2019-07-24",{"$f":"COUNTIFS(Таблица1[Date],Таблица6[[#This Row],[2019]])+SUMIFS(Таблица1[Re-entry],Таблица1[Date],Таблица6[[#This Row],[2019]])","v":0},{"$f":"SUMIFS(Таблица1[Total Buy-In],Таблица1[Date],Таблица6[[#This Row],[2019]])","v":0},{"$f":"IFERROR(Таблица6[Buy-in]/Таблица6[Games],0)","v":0},{"$f":"IFERROR((Таблица6[Profit]/Таблица6[Buy-in])*100,0)","v":0},{"$f":"IFERROR((COUNTIFS(Таблица1[Date],Таблица6[2019],Таблица1[Winnings],\">0\")/Таблица6[Games])*100,0)","v":0},{"$f":"SUMIFS(Таблица1[Total Hands],Таблица1[Date],Таблица6[[#This Row],[2019]])","v":0},{"$f":"IFERROR(SUMIFS(Таблица1[bb/101],Таблица1[Date],Таблица6[[#This Row],[2019]])/Таблица6[[#This Row],[Hand]],0)","v":0},{"$f":"IFERROR(SUMIFS(Таблица1[EV bb/101],Таблица1[Date],Таблица6[[#This Row],[2019]])/Таблица6[[#This Row],[Hand]],0)","v":0},{"$f":"SUMIFS(Таблица1[Net Winnings],Таблица1[Date],Таблица6[2019])","v":0},{"$f":"IFERROR(Таблица6[[#This Row],[Profit]]/Таблица6[[#This Row],[Games]],0)","v":0}]
[null,"2019-07-25",{"$f":"COUNTIFS(Таблица1[Date],Таблица6[[#This Row],[2019]])+SUMIFS(Таблица1[Re-entry],Таблица1[Date],Таблица6[[#This Row],[2019]])","v":0},{"$f":"SUMIFS(Таблица1[Total Buy-In],Таблица1[Date],Таблица6[[#This Row],[2019]])","v":0},{"$f":"IFERROR(Таблица6[Buy-in]/Таблица6[Games],0)","v":0},{"$f":"IFERROR((Таблица6[Profit]/Таблица6[Buy-in])*100,0)","v":0},{"$f":"IFERROR((COUNTIFS(Таблица1[Date],Таблица6[2019],Таблица1[Winnings],\">0\")/Таблица6[Games])*100,0)","v":0},{"$f":"SUMIFS(Таблица1[Total Hands],Таблица1[Date],Таблица6[[#This Row],[2019]])","v":0},{"$f":"IFERROR(SUMIFS(Таблица1[bb/101],Таблица1[Date],Таблица6[[#This Row],[2019]])/Таблица6[[#This Row],[Hand]],0)","v":0},{"$f":"IFERROR(SUMIFS(Таблица1[EV bb/101],Таблица1[Date],Таблица6[[#This Row],[2019]])/Таблица6[[#This Row],[Hand]],0)","v":0},{"$f":"SUMIFS(Таблица1[Net Winnings],Таблица1[Date],Таблица6[2019])","v":0},{"$f":"IFERROR(Таблица6[[#This Row],[Profit]]/Таблица6[[#This Row],[Games]],0)","v":0}]
[null,"2019-07-26",{"$f":"COUNTIFS(Таблица1[Date],Таблица6[[#This Row],[2019]])+SUMIFS(Таблица1[Re-entry],Таблица1[Date],Таблица6[[#This Row],[2019]])","v":0},{"$f":"SUMIFS(Таблица1[Total Buy-In],Таблица1[Date],Таблица6[[#This Row],[2019]])","v":0},{"$f":"IFERROR(Таблица6[Buy-in]/Таблица6[Games],0)","v":0},{"$f":"IFERROR((Таблица6[Profit]/Таблица6[Buy-in])*100,0)","v":0},{"$f":"IFERROR((COUNTIFS(Таблица1[Date],Таблица6[2019],Таблица1[Winnings],\">0\")/Таблица6[Games])*100,0)","v":0},{"$f":"SUMIFS(Таблица1[Total Hands],Таблица1[Date],Таблица6[[#This Row],[2019]])","v":0},{"$f":"IFERROR(SUMIFS(Таблица1[bb/101],Таблица1[Date],Таблица6[[#This Row],[2019]])/Таблица6[[#This Row],[Hand]],0)","v":0},{"$f":"IFERROR(SUMIFS(Таблица1[EV bb/101],Таблица1[Date],Таблица6[[#This Row],[2019]])/Таблица6[[#This Row],[Hand]],0)","v":0},{"$f":"SUMIFS(Таблица1[Net Winnings],Таблица1[Date],Таблица6[2019])","v":0},{"$f":"IFERROR(Таблица6[[#This Row],[Profit]]/Таблица6[[#This Row],[Games]],0)","v":0}]
[null,"2019-07-27",{"$f":"COUNTIFS(Таблица1[Date],Таблица6[[#This Row],[2019]])+SUMIFS(Таблица1[Re-entry],Таблица1[Date],Таблица6[[#This Row],[2019]])","v":0},{"$f":"SUMIFS(Таблица1[Total Buy-In],Таблица1[Date],Таблица6[[#This Row],[2019]])","v":0},{"$f":"IFERROR(Таблица6[Buy-in]/Таблица6[Games],0)","v":0},{"$f":"IFERROR((Таблица6[Profit]/Таблица6[Buy-in])*100,0)","v":0},{"$f":"IFERROR((COUNTIFS(Таблица1[Date],Таблица6[2019],Таблица1[Winnings],\">0\")/Таблица6[Games])*100,0)","v":0},{"$f":"SUMIFS(Таблица1[Total Hands],Таблица1[Date],Таблица6[[#This Row],[2019]])","v":0},{"$f":"IFERROR(SUMIFS(Таблица1[bb/101],Таблица1[Date],Таблица6[[#This Row],[2019]])/Таблица6[[#This Row],[Hand]],0)","v":0},{"$f":"IFERROR(SUMIFS(Таблица1[EV bb/101],Таблица1[Date],Таблица6[[#This Row],[2019]])/Таблица6[[#This Row],[Hand]],0)","v":0},{"$f":"SUMIFS(Таблица1[Net Winnings],Таблица1[Date],Таблица6[2019])","v":0},{"$f":"IFERROR(Таблица6[[#This Row],[Profit]]/Таблица6[[#This Row],[Games]],0)","v":0}]
[null,"2019-07-28",{"$f":"COUNTIFS(Таблица1[Date],Таблица6[[#This Row],[2019]])+SUMIFS(Таблица1[Re-entry],Таблица1[Date],Таблица6[[#This Row],[2019]])","v":0},{"$f":"SUMIFS(Таблица1[Total Buy-In],Таблица1[Date],Таблица6[[#This Row],[2019]])","v":0},{"$f":"IFERROR(Таблица6[Buy-in]/Таблица6[Games],0)","v":0},{"$f":"IFERROR((Таблица6[Profit]/Таблица6[Buy-in])*100,0)","v":0},{"$f":"IFERROR((COUNTIFS(Таблица1[Date],Таблица6[2019],Таблица1[Winnings],\">0\")/Таблица6[Games])*100,0)","v":0},{"$f":"SUMIFS(Таблица1[Total Hands],Таблица1[Date],Таблица6[[#This Row],[2019]])","v":0},{"$f":"IFERROR(SUMIFS(Таблица1[bb/101],Таблица1[Date],Таблица6[[#This Row],[2019]])/Таблица6[[#This Row],[Hand]],0)","v":0},{"$f":"IFERROR(SUMIFS(Таблица1[EV bb/101],Таблица1[Date],Таблица6[[#This Row],[2019]])/Таблица6[[#This Row],[Hand]],0)","v":0},{"$f":"SUMIFS(Таблица1[Net Winnings],Таблица1[Date],Таблица6[2019])","v":0},{"$f":"IFERROR(Таблица6[[#This Row],[Profit]]/Таблица6[[#This Row],[Games]],0)","v":0}]
[null,"2019-07-29",{"$f":"COUNTIFS(Таблица1[Date],Таблица6[[#This Row],[2019]])+SUMIFS(Таблица1[Re-entry],Таблица1[Date],Таблица6[[#This Row],[2019]])","v":0},{"$f":"SUMIFS(Таблица1[Total Buy-In],Таблица1[Date],Таблица6[[#This Row],[2019]])","v":0},{"$f":"IFERROR(Таблица6[Buy-in]/Таблица6[Games],0)","v":0},{"$f":"IFERROR((Таблица6[Profit]/Таблица6[Buy-in])*100,0)","v":0},{"$f":"IFERROR((COUNTIFS(Таблица1[Date],Таблица6[2019],Таблица1[Winnings],\">0\")/Таблица6[Games])*100,0)","v":0},{"$f":"SUMIFS(Таблица1[Total Hands],Таблица1[Date],Таблица6[[#This Row],[2019]])","v":0},{"$f":"IFERROR(SUMIFS(Таблица1[bb/101],Таблица1[Date],Таблица6[[#This Row],[2019]])/Таблица6[[#This Row],[Hand]],0)","v":0},{"$f":"IFERROR(SUMIFS(Таблица1[EV bb/101],Таблица1[Date],Таблица6[[#This Row],[2019]])/Таблица6[[#This Row],[Hand]],0)","v":0},{"$f":"SUMIFS(Таблица1[Net Winnings],Таблица1[Date],Таблица6[2019])","v":0},{"$f":"IFERROR(Таблица6[[#This Row],[Profit]]/Таблица6[[#This Row],[Games]],0)","v":0}]
[null,"2019-07-30",{"$f":"COUNTIFS(Таблица1[Date],Таблица6[[#This Row],[2019]])+SUMIFS(Таблица1[Re-entry],Таблица1[Date],Таблица6[[#This Row],[2019]])","v":0},{"$f":"SUMIFS(Таблица1[Total Buy-In],Таблица1[Date],Таблица6[[#This Row],[2019]])","v":0},{"$f":"IFERROR(Таблица6[Buy-in]/Таблица6[Games],0)","v":0},{"$f":"IFERROR((Таблица6[Profit]/Таблица6[Buy-in])*100,0)","v":0},{"$f":"IFERROR((COUNTIFS(Таблица1[Date],Таблица6[2019],Таблица1[Winnings],\">0\")/Таблица6[Games])*100,0)","v":0},{"$f":"SUMIFS(Таблица1[Total Hands],Таблица1[Date],Таблица6[[#This Row],[2019]])","v":0},{"$f":"IFERROR(SUMIFS(Таблица1[bb/101],Таблица1[Date],Таблица6[[#This Row],[2019]])/Таблица6[[#This Row],[Hand]],0)","v":0},{"$f":"IFERROR(SUMIFS(Таблица1[EV bb/101],Таблица1[Date],Таблица6[[#This Row],[2019]])/Таблица6[[#This Row],[Hand]],0)","v":0},{"$f":"SUMIFS(Таблица1[Net Winnings],Таблица1[Date],Таблица6[2019])","v":0},{"$f":"IFERROR(Таблица6[[#This Row],[Profit]]/Таблица6[[#This Row],[Games]],0)","v":0}]
[null,"2019-07-31",{"$f":"COUNTIFS(Таблица1[Date],Таблица6[[#This Row],[2019]])+SUMIFS(Таблица1[Re-entry],Таблица1[Date],Таблица6[[#This Row],[2019]])","v":0},{"$f":"SUMIFS(Таблица1[Total Buy-In],Таблица1[Date],Таблица6[[#This Row],[2019]])","v":0},{"$f":"IFERROR(Таблица6[Buy-in]/Таблица6[Games],0)","v":0},{"$f":"IFERROR((Таблица6[Profit]/Таблица6[Buy-in])*100,0)","v":0},{"$f":"IFERROR((COUNTIFS(Таблица1[Date],Таблица6[2019],Таблица1[Winnings],\">0\")/Таблица6[Games])*100,0)","v":0},{"$f":"SUMIFS(Таблица1[Total Hands],Таблица1[Date],Таблица6[[#This Row],[2019]])","v":0},{"$f":"IFERROR(SUMIFS(Таблица1[bb/101],Таблица1[Date],Таблица6[[#This Row],[2019]])/Таблица6[[#This Row],[Hand]],0)","v":0},{"$f":"IFERROR(SUMIFS(Таблица1[EV bb/101],Таблица1[Date],Таблица6[[#This Row],[2019]])/Таблица6[[#This Row],[Hand]],0)","v":0},{"$f":"SUMIFS(Таблица1[Net Winnings],Таблица1[Date],Таблица6[2019])","v":0},{"$f":"IFERROR(Таблица6[[#This Row],[Profit]]/Таблица6[[#This Row],[Games]],0)","v":0}]
[null,"2019-08-01",{"$f":"COUNTIFS(Таблица1[Date],Таблица6[[#This Row],[2019]])+SUMIFS(Таблица1[Re-entry],Таблица1[Date],Таблица6[[#This Row],[2019]])","v":0},{"$f":"SUMIFS(Таблица1[Total Buy-In],Таблица1[Date],Таблица6[[#This Row],[2019]])","v":0},{"$f":"IFERROR(Таблица6[Buy-in]/Таблица6[Games],0)","v":0},{"$f":"IFERROR((Таблица6[Profit]/Таблица6[Buy-in])*100,0)","v":0},{"$f":"IFERROR((COUNTIFS(Таблица1[Date],Таблица6[2019],Таблица1[Winnings],\">0\")/Таблица6[Games])*100,0)","v":0},{"$f":"SUMIFS(Таблица1[Total Hands],Таблица1[Date],Таблица6[[#This Row],[2019]])","v":0},{"$f":"IFERROR(SUMIFS(Таблица1[bb/101],Таблица1[Date],Таблица6[[#This Row],[2019]])/Таблица6[[#This Row],[Hand]],0)","v":0},{"$f":"IFERROR(SUMIFS(Таблица1[EV bb/101],Таблица1[Date],Таблица6[[#This Row],[2019]])/Таблица6[[#This Row],[Hand]],0)","v":0},{"$f":"SUMIFS(Таблица1[Net Winnings],Таблица1[Date],Таблица6[2019])","v":0},{"$f":"IFERROR(Таблица6[[#This Row],[Profit]]/Таблица6[[#This Row],[Games]],0)","v":0}]
[null,"2019-08-02",{"$f":"COUNTIFS(Таблица1[Date],Таблица6[[#This Row],[2019]])+SUMIFS(Таблица1[Re-entry],Таблица1[Date],Таблица6[[#This Row],[2019]])","v":0},{"$f":"SUMIFS(Таблица1[Total Buy-In],Таблица1[Date],Таблица6[[#This Row],[2019]])","v":0},{"$f":"IFERROR(Таблица6[Buy-in]/Таблица6[Games],0)","v":0},{"$f":"IFERROR((Таблица6[Profit]/Таблица6[Buy-in])*100,0)","v":0},{"$f":"IFERROR((COUNTIFS(Таблица1[Date],Таблица6[2019],Таблица1[Winnings],\">0\")/Таблица6[Games])*100,0)","v":0},{"$f":"SUMIFS(Таблица1[Total Hands],Таблица1[Date],Таблица6[[#This Row],[2019]])","v":0},{"$f":"IFERROR(SUMIFS(Таблица1[bb/101],Таблица1[Date],Таблица6[[#This Row],[2019]])/Таблица6[[#This Row],[Hand]],0)","v":0},{"$f":"IFERROR(SUMIFS(Таблица1[EV bb/101],Таблица1[Date],Таблица6[[#This Row],[2019]])/Таблица6[[#This Row],[Hand]],0)","v":0},{"$f":"SUMIFS(Таблица1[Net Winnings],Таблица1[Date],Таблица6[2019])","v":0},{"$f":"IFERROR(Таблица6[[#This Row],[Profit]]/Таблица6[[#This Row],[Games]],0)","v":0}]
[null,"2019-08-03",{"$f":"COUNTIFS(Таблица1[Date],Таблица6[[#This Row],[2019]])+SUMIFS(Таблица1[Re-entry],Таблица1[Date],Таблица6[[#This Row],[2019]])","v":0},{"$f":"SUMIFS(Таблица1[Total Buy-In],Таблица1[Date],Таблица6[[#This Row],[2019]])","v":0},{"$f":"IFERROR(Таблица6[Buy-in]/Таблица6[Games],0)","v":0},{"$f":"IFERROR((Таблица6[Profit]/Таблица6[Buy-in])*100,0)","v":0},{"$f":"IFERROR((COUNTIFS(Таблица1[Date],Таблица6[2019],Таблица1[Winnings],\">0\")/Таблица6[Games])*100,0)","v":0},{"$f":"SUMIFS(Таблица1[Total Hands],Таблица1[Date],Таблица6[[#This Row],[2019]])","v":0},{"$f":"IFERROR(SUMIFS(Таблица1[bb/101],Таблица1[Date],Таблица6[[#This Row],[2019]])/Таблица6[[#This Row],[Hand]],0)","v":0},{"$f":"IFERROR(SUMIFS(Таблица1[EV bb/101],Таблица1[Date],Таблица6[[#This Row],[2019]])/Таблица6[[#This Row],[Hand]],0)","v":0},{"$f":"SUMIFS(Таблица1[Net Winnings],Таблица1[Date],Таблица6[2019])","v":0},{"$f":"IFERROR(Таблица6[[#This Row],[Profit]]/Таблица6[[#This Row],[Games]],0)","v":0}]
[null,"2019-08-04",{"$f":"COUNTIFS(Таблица1[Date],Таблица6[[#This Row],[2019]])+SUMIFS(Таблица1[Re-entry],Таблица1[Date],Таблица6[[#This Row],[2019]])","v":0},{"$f":"SUMIFS(Таблица1[Total Buy-In],Таблица1[Date],Таблица6[[#This Row],[2019]])","v":0},{"$f":"IFERROR(Таблица6[Buy-in]/Таблица6[Games],0)","v":0},{"$f":"IFERROR((Таблица6[Profit]/Таблица6[Buy-in])*100,0)","v":0},{"$f":"IFERROR((COUNTIFS(Таблица1[Date],Таблица6[2019],Таблица1[Winnings],\">0\")/Таблица6[Games])*100,0)","v":0},{"$f":"SUMIFS(Таблица1[Total Hands],Таблица1[Date],Таблица6[[#This Row],[2019]])","v":0},{"$f":"IFERROR(SUMIFS(Таблица1[bb/101],Таблица1[Date],Таблица6[[#This Row],[2019]])/Таблица6[[#This Row],[Hand]],0)","v":0},{"$f":"IFERROR(SUMIFS(Таблица1[EV bb/101],Таблица1[Date],Таблица6[[#This Row],[2019]])/Таблица6[[#This Row],[Hand]],0)","v":0},{"$f":"SUMIFS(Таблица1[Net Winnings],Таблица1[Date],Таблица6[2019])","v":0},{"$f":"IFERROR(Таблица6[[#This Row],[Profit]]/Таблица6[[#This Row],[Games]],0)","v":0}]
[null,"2019-08-05",{"$f":"COUNTIFS(Таблица1[Date],Таблица6[[#This Row],[2019]])+SUMIFS(Таблица1[Re-entry],Таблица1[Date],Таблица6[[#This Row],[2019]])","v":0},{"$f":"SUMIFS(Таблица1[Total Buy-In],Таблица1[Date],Таблица6[[#This Row],[2019]])","v":0},{"$f":"IFERROR(Таблица6[Buy-in]/Таблица6[Games],0)","v":0},{"$f":"IFERROR((Таблица6[Profit]/Таблица6[Buy-in])*100,0)","v":0},{"$f":"IFERROR((COUNTIFS(Таблица1[Date],Таблица6[2019],Таблица1[Winnings],\">0\")/Таблица6[Games])*100,0)","v":0},{"$f":"SUMIFS(Таблица1[Total Hands],Таблица1[Date],Таблица6[[#This Row],[2019]])","v":0},{"$f":"IFERROR(SUMIFS(Таблица1[bb/101],Таблица1[Date],Таблица6[[#This Row],[2019]])/Таблица6[[#This Row],[Hand]],0)","v":0},{"$f":"IFERROR(SUMIFS(Таблица1[EV bb/101],Таблица1[Date],Таблица6[[#This Row],[2019]])/Таблица6[[#This Row],[Hand]],0)","v":0},{"$f":"SUMIFS(Таблица1[Net Winnings],Таблица1[Date],Таблица6[2019])","v":0},{"$f":"IFERROR(Таблица6[[#This Row],[Profit]]/Таблица6[[#This Row],[Games]],0)","v":0}]
[null,"2019-08-06",{"$f":"COUNTIFS(Таблица1[Date],Таблица6[[#This Row],[2019]])+SUMIFS(Таблица1[Re-entry],Таблица1[Date],Таблица6[[#This Row],[2019]])","v":0},{"$f":"SUMIFS(Таблица1[Total Buy-In],Таблица1[Date],Таблица6[[#This Row],[2019]])","v":0},{"$f":"IFERROR(Таблица6[Buy-in]/Таблица6[Games],0)","v":0},{"$f":"IFERROR((Таблица6[Profit]/Таблица6[Buy-in])*100,0)","v":0},{"$f":"IFERROR((COUNTIFS(Таблица1[Date],Таблица6[2019],Таблица1[Winnings],\">0\")/Таблица6[Games])*100,0)","v":0},{"$f":"SUMIFS(Таблица1[Total Hands],Таблица1[Date],Таблица6[[#This Row],[2019]])","v":0},{"$f":"IFERROR(SUMIFS(Таблица1[bb/101],Таблица1[Date],Таблица6[[#This Row],[2019]])/Таблица6[[#This Row],[Hand]],0)","v":0},{"$f":"IFERROR(SUMIFS(Таблица1[EV bb/101],Таблица1[Date],Таблица6[[#This Row],[2019]])/Таблица6[[#This Row],[Hand]],0)","v":0},{"$f":"SUMIFS(Таблица1[Net Winnings],Таблица1[Date],Таблица6[2019])","v":0},{"$f":"IFERROR(Таблица6[[#This Row],[Profit]]/Таблица6[[#This Row],[Games]],0)","v":0}]
[null,"2019-08-07",{"$f":"COUNTIFS(Таблица1[Date],Таблица6[[#This Row],[2019]])+SUMIFS(Таблица1[Re-entry],Таблица1[Date],Таблица6[[#This Row],[2019]])","v":0},{"$f":"SUMIFS(Таблица1[Total Buy-In],Таблица1[Date],Таблица6[[#This Row],[2019]])","v":0},{"$f":"IFERROR(Таблица6[Buy-in]/Таблица6[Games],0)","v":0},{"$f":"IFERROR((Таблица6[Profit]/Таблица6[Buy-in])*100,0)","v":0},{"$f":"IFERROR((COUNTIFS(Таблица1[Date],Таблица6[2019],Таблица1[Winnings],\">0\")/Таблица6[Games])*100,0)","v":0},{"$f":"SUMIFS(Таблица1[Total Hands],Таблица1[Date],Таблица6[[#This Row],[2019]])","v":0},{"$f":"IFERROR(SUMIFS(Таблица1[bb/101],Таблица1[Date],Таблица6[[#This Row],[2019]])/Таблица6[[#This Row],[Hand]],0)","v":0},{"$f":"IFERROR(SUMIFS(Таблица1[EV bb/101],Таблица1[Date],Таблица6[[#This Row],[2019]])/Таблица6[[#This Row],[Hand]],0)","v":0},{"$f":"SUMIFS(Таблица1[Net Winnings],Таблица1[Date],Таблица6[2019])","v":0},{"$f":"IFERROR(Таблица6[[#This Row],[Profit]]/Таблица6[[#This Row],[Games]],0)","v":0}]
[null,"2019-08-08",{"$f":"COUNTIFS(Таблица1[Date],Таблица6[[#This Row],[2019]])+SUMIFS(Таблица1[Re-entry],Таблица1[Date],Таблица6[[#This Row],[2019]])","v":0},{"$f":"SUMIFS(Таблица1[Total Buy-In],Таблица1[Date],Таблица6[[#This Row],[2019]])","v":0},{"$f":"IFERROR(Таблица6[Buy-in]/Таблица6[Games],0)","v":0},{"$f":"IFERROR((Таблица6[Profit]/Таблица6[Buy-in])*100,0)","v":0},{"$f":"IFERROR((COUNTIFS(Таблица1[Date],Таблица6[2019],Таблица1[Winnings],\">0\")/Таблица6[Games])*100,0)","v":0},{"$f":"SUMIFS(Таблица1[Total Hands],Таблица1[Date],Таблица6[[#This Row],[2019]])","v":0},{"$f":"IFERROR(SUMIFS(Таблица1[bb/101],Таблица1[Date],Таблица6[[#This Row],[2019]])/Таблица6[[#This Row],[Hand]],0)","v":0},{"$f":"IFERROR(SUMIFS(Таблица1[EV bb/101],Таблица1[Date],Таблица6[[#This Row],[2019]])/Таблица6[[#This Row],[Hand]],0)","v":0},{"$f":"SUMIFS(Таблица1[Net Winnings],Таблица1[Date],Таблица6[2019])","v":0},{"$f":"IFERROR(Таблица6[[#This Row],[Profit]]/Таблица6[[#This Row],[Games]],0)","v":0}]
[null,"2019-08-09",{"$f":"COUNTIFS(Таблица1[Date],Таблица6[[#This Row],[2019]])+SUMIFS(Таблица1[Re-entry],Таблица1[Date],Таблица6[[#This Row],[2019]])","v":0},{"$f":"SUMIFS(Таблица1[Total Buy-In],Таблица1[Date],Таблица6[[#This Row],[2019]])","v":0},{"$f":"IFERROR(Таблица6[Buy-in]/Таблица6[Games],0)","v":0},{"$f":"IFERROR((Таблица6[Profit]/Таблица6[Buy-in])*100,0)","v":0},{"$f":"IFERROR((COUNTIFS(Таблица1[Date],Таблица6[2019],Таблица1[Winnings],\">0\")/Таблица6[Games])*100,0)","v":0},{"$f":"SUMIFS(Таблица1[Total Hands],Таблица1[Date],Таблица6[[#This Row],[2019]])","v":0},{"$f":"IFERROR(SUMIFS(Таблица1[bb/101],Таблица1[Date],Таблица6[[#This Row],[2019]])/Таблица6[[#This Row],[Hand]],0)","v":0},{"$f":"IFERROR(SUMIFS(Таблица1[EV bb/101],Таблица1[Date],Таблица6[[#This Row],[2019]])/Таблица6[[#This Row],[Hand]],0)","v":0},{"$f":"SUMIFS(Таблица1[Net Winnings],Таблица1[Date],Таблица6[2019])","v":0},{"$f":"IFERROR(Таблица6[[#This Row],[Profit]]/Таблица6[[#This Row],[Games]],0)","v":0}]
[null,"2019-08-10",{"$f":"COUNTIFS(Таблица1[Date],Таблица6[[#This Row],[2019]])+SUMIFS(Таблица1[Re-entry],Таблица1[Date],Таблица6[[#This Row],[2019]])","v":0},{"$f":"SUMIFS(Таблица1[Total Buy-In],Таблица1[Date],Таблица6[[#This Row],[2019]])","v":0},{"$f":"IFERROR(Таблица6[Buy-in]/Таблица6[Games],0)","v":0},{"$f":"IFERROR((Таблица6[Profit]/Таблица6[Buy-in])*100,0)","v":0},{"$f":"IFERROR((COUNTIFS(Таблица1[Date],Таблица6[2019],Таблица1[Winnings],\">0\")/Таблица6[Games])*100,0)","v":0},{"$f":"SUMIFS(Таблица1[Total Hands],Таблица1[Date],Таблица6[[#This Row],[2019]])","v":0},{"$f":"IFERROR(SUMIFS(Таблица1[bb/101],Таблица1[Date],Таблица6[[#This Row],[2019]])/Таблица6[[#This Row],[Hand]],0)","v":0},{"$f":"IFERROR(SUMIFS(Таблица1[EV bb/101],Таблица1[Date],Таблица6[[#This Row],[2019]])/Таблица6[[#This Row],[Hand]],0)","v":0},{"$f":"SUMIFS(Таблица1[Net Winnings],Таблица1[Date],Таблица6[2019])","v":0},{"$f":"IFERROR(Таблица6[[#This Row],[Profit]]/Таблица6[[#This Row],[Games]],0)","v":0}]
[null,"2019-08-11",{"$f":"COUNTIFS(Таблица1[Date],Таблица6[[#This Row],[2019]])+SUMIFS(Таблица1[Re-entry],Таблица1[Date],Таблица6[[#This Row],[2019]])","v":0},{"$f":"SUMIFS(Таблица1[Total Buy-In],Таблица1[Date],Таблица6[[#This Row],[2019]])","v":0},{"$f":"IFERROR(Таблица6[Buy-in]/Таблица6[Games],0)","v":0},{"$f":"IFERROR((Таблица6[Profit]/Таблица6[Buy-in])*100,0)","v":0},{"$f":"IFERROR((COUNTIFS(Таблица1[Date],Таблица6[2019],Таблица1[Winnings],\">0\")/Таблица6[Games])*100,0)","v":0},{"$f":"SUMIFS(Таблица1[Total Hands],Таблица1[Date],Таблица6[[#This Row],[2019]])","v":0},{"$f":"IFERROR(SUMIFS(Таблица1[bb/101],Таблица1[Date],Таблица6[[#This Row],[2019]])/Таблица6[[#This Row],[Hand]],0)","v":0},{"$f":"IFERROR(SUMIFS(Таблица1[EV bb/101],Таблица1[Date],Таблица6[[#This Row],[2019]])/Таблица6[[#This Row],[Hand]],0)","v":0},{"$f":"SUMIFS(Таблица1[Net Winnings],Таблица1[Date],Таблица6[2019])","v":0},{"$f":"IFERROR(Таблица6[[#This Row],[Profit]]/Таблица6[[#This Row],[Games]],0)","v":0}]
[null,"2019-08-12",{"$f":"COUNTIFS(Таблица1[Date],Таблица6[[#This Row],[2019]])+SUMIFS(Таблица1[Re-entry],Таблица1[Date],Таблица6[[#This Row],[2019]])","v":0},{"$f":"SUMIFS(Таблица1[Total Buy-In],Таблица1[Date],Таблица6[[#This Row],[2019]])","v":0},{"$f":"IFERROR(Таблица6[Buy-in]/Таблица6[Games],0)","v":0},{"$f":"IFERROR((Таблица6[Profit]/Таблица6[Buy-in])*100,0)","v":0},{"$f":"IFERROR((COUNTIFS(Таблица1[Date],Таблица6[2019],Таблица1[Winnings],\">0\")/Таблица6[Games])*100,0)","v":0},{"$f":"SUMIFS(Таблица1[Total Hands],Таблица1[Date],Таблица6[[#This Row],[2019]])","v":0},{"$f":"IFERROR(SUMIFS(Таблица1[bb/101],Таблица1[Date],Таблица6[[#This Row],[2019]])/Таблица6[[#This Row],[Hand]],0)","v":0},{"$f":"IFERROR(SUMIFS(Таблица1[EV bb/101],Таблица1[Date],Таблица6[[#This Row],[2019]])/Таблица6[[#This Row],[Hand]],0)","v":0},{"$f":"SUMIFS(Таблица1[Net Winnings],Таблица1[Date],Таблица6[2019])","v":0},{"$f":"IFERROR(Таблица6[[#This Row],[Profit]]/Таблица6[[#This Row],[Games]],0)","v":0}]
[null,"2019-08-13",{"$f":"COUNTIFS(Таблица1[Date],Таблица6[[#This Row],[2019]])+SUMIFS(Таблица1[Re-entry],Таблица1[Date],Таблица6[[#This Row],[2019]])","v":0},{"$f":"SUMIFS(Таблица1[Total Buy-In],Таблица1[Date],Таблица6[[#This Row],[2019]])","v":0},{"$f":"IFERROR(Таблица6[Buy-in]/Таблица6[Games],0)","v":0},{"$f":"IFERROR((Таблица6[Profit]/Таблица6[Buy-in])*100,0)","v":0},{"$f":"IFERROR((COUNTIFS(Таблица1[Date],Таблица6[2019],Таблица1[Winnings],\">0\")/Таблица6[Games])*100,0)","v":0},{"$f":"SUMIFS(Таблица1[Total Hands],Таблица1[Date],Таблица6[[#This Row],[2019]])","v":0},{"$f":"IFERROR(SUMIFS(Таблица1[bb/101],Таблица1[Date],Таблица6[[#This Row],[2019]])/Таблица6[[#This Row],[Hand]],0)","v":0},{"$f":"IFERROR(SUMIFS(Таблица1[EV bb/101],Таблица1[Date],Таблица6[[#This Row],[2019]])/Таблица6[[#This Row],[Hand]],0)","v":0},{"$f":"SUMIFS(Таблица1[Net Winnings],Таблица1[Date],Таблица6[2019])","v":0},{"$f":"IFERROR(Таблица6[[#This Row],[Profit]]/Таблица6[[#This Row],[Games]],0)","v":0}]
[null,"2019-08-14",{"$f":"COUNTIFS(Таблица1[Date],Таблица6[[#This Row],[2019]])+SUMIFS(Таблица1[Re-entry],Таблица1[Date],Таблица6[[#This Row],[2019]])","v":0},{"$f":"SUMIFS(Таблица1[Total Buy-In],Таблица1[Date],Таблица6[[#This Row],[2019]])","v":0},{"$f":"IFERROR(Таблица6[Buy-in]/Таблица6[Games],0)","v":0},{"$f":"IFERROR((Таблица6[Profit]/Таблица6[Buy-in])*100,0)","v":0},{"$f":"IFERROR((COUNTIFS(Таблица1[Date],Таблица6[2019],Таблица1[Winnings],\">0\")/Таблица6[Games])*100,0)","v":0},{"$f":"SUMIFS(Таблица1[Total Hands],Таблица1[Date],Таблица6[[#This Row],[2019]])","v":0},{"$f":"IFERROR(SUMIFS(Таблица1[bb/101],Таблица1[Date],Таблица6[[#This Row],[2019]])/Таблица6[[#This Row],[Hand]],0)","v":0},{"$f":"IFERROR(SUMIFS(Таблица1[EV bb/101],Таблица1[Date],Таблица6[[#This Row],[2019]])/Таблица6[[#This Row],[Hand]],0)","v":0},{"$f":"SUMIFS(Таблица1[Net Winnings],Таблица1[Date],Таблица6[2019])","v":0},{"$f":"IFERROR(Таблица6[[#This Row],[Profit]]/Таблица6[[#This Row],[Games]],0)","v":0}]
[null,"2019-08-15",{"$f":"COUNTIFS(Таблица1[Date],Таблица6[[#This Row],[2019]])+SUMIFS(Таблица1[Re-entry],Таблица1[Date],Таблица6[[#This Row],[2019]])","v":0},{"$f":"SUMIFS(Таблица1[Total Buy-In],Таблица1[Date],Таблица6[[#This Row],[2019]])","v":0},{"$f":"IFERROR(Таблица6[Buy-in]/Таблица6[Games],0)","v":0},{"$f":"IFERROR((Таблица6[Profit]/Таблица6[Buy-in])*100,0)","v":0},{"$f":"IFERROR((COUNTIFS(Таблица1[Date],Таблица6[2019],Таблица1[Winnings],\">0\")/Таблица6[Games])*100,0)","v":0},{"$f":"SUMIFS(Таблица1[Total Hands],Таблица1[Date],Таблица6[[#This Row],[2019]])","v":0},{"$f":"IFERROR(SUMIFS(Таблица1[bb/101],Таблица1[Date],Таблица6[[#This Row],[2019]])/Таблица6[[#This Row],[Hand]],0)","v":0},{"$f":"IFERROR(SUMIFS(Таблица1[EV bb/101],Таблица1[Date],Таблица6[[#This Row],[2019]])/Таблица6[[#This Row],[Hand]],0)","v":0},{"$f":"SUMIFS(Таблица1[Net Winnings],Таблица1[Date],Таблица6[2019])","v":0},{"$f":"IFERROR(Таблица6[[#This Row],[Profit]]/Таблица6[[#This Row],[Games]],0)","v":0}]
[null,"2019-08-16",{"$f":"COUNTIFS(Таблица1[Date],Таблица6[[#This Row],[2019]])+SUMIFS(Таблица1[Re-entry],Таблица1[Date],Таблица6[[#This Row],[2019]])","v":0},{"$f":"SUMIFS(Таблица1[Total Buy-In],Таблица1[Date],Таблица6[[#This Row],[2019]])","v":0},{"$f":"IFERROR(Таблица6[Buy-in]/Таблица6[Games],0)","v":0},{"$f":"IFERROR((Таблица6[Profit]/Таблица6[Buy-in])*100,0)","v":0},{"$f":"IFERROR((COUNTIFS(Таблица1[Date],Таблица6[2019],Таблица1[Winnings],\">0\")/Таблица6[Games])*100,0)","v":0},{"$f":"SUMIFS(Таблица1[Total Hands],Таблица1[Date],Таблица6[[#This Row],[2019]])","v":0},{"$f":"IFERROR(SUMIFS(Таблица1[bb/101],Таблица1[Date],Таблица6[[#This Row],[2019]])/Таблица6[[#This Row],[Hand]],0)","v":0},{"$f":"IFERROR(SUMIFS(Таблица1[EV bb/101],Таблица1[Date],Таблица6[[#This Row],[2019]])/Таблица6[[#This Row],[Hand]],0)","v":0},{"$f":"SUMIFS(Таблица1[Net Winnings],Таблица1[Date],Таблица6[2019])","v":0},{"$f":"IFERROR(Таблица6[[#This Row],[Profit]]/Таблица6[[#This Row],[Games]],0)","v":0}]
[null,"2019-08-17",{"$f":"COUNTIFS(Таблица1[Date],Таблица6[[#This Row],[2019]])+SUMIFS(Таблица1[Re-entry],Таблица1[Date],Таблица6[[#This Row],[2019]])","v":0},{"$f":"SUMIFS(Таблица1[Total Buy-In],Таблица1[Date],Таблица6[[#This Row],[2019]])","v":0},{"$f":"IFERROR(Таблица6[Buy-in]/Таблица6[Games],0)","v":0},{"$f":"IFERROR((Таблица6[Profit]/Таблица6[Buy-in])*100,0)","v":0},{"$f":"IFERROR((COUNTIFS(Таблица1[Date],Таблица6[2019],Таблица1[Winnings],\">0\")/Таблица6[Games])*100,0)","v":0},{"$f":"SUMIFS(Таблица1[Total Hands],Таблица1[Date],Таблица6[[#This Row],[2019]])","v":0},{"$f":"IFERROR(SUMIFS(Таблица1[bb/101],Таблица1[Date],Таблица6[[#This Row],[2019]])/Таблица6[[#This Row],[Hand]],0)","v":0},{"$f":"IFERROR(SUMIFS(Таблица1[EV bb/101],Таблица1[Date],Таблица6[[#This Row],[2019]])/Таблица6[[#This Row],[Hand]],0)","v":0},{"$f":"SUMIFS(Таблица1[Net Winnings],Таблица1[Date],Таблица6[2019])","v":0},{"$f":"IFERROR(Таблица6[[#This Row],[Profit]]/Таблица6[[#This Row],[Games]],0)","v":0}]
[null,"2019-08-18",{"$f":"COUNTIFS(Таблица1[Date],Таблица6[[#This Row],[2019]])+SUMIFS(Таблица1[Re-entry],Таблица1[Date],Таблица6[[#This Row],[2019]])","v":0},{"$f":"SUMIFS(Таблица1[Total Buy-In],Таблица1[Date],Таблица6[[#This Row],[2019]])","v":0},{"$f":"IFERROR(Таблица6[Buy-in]/Таблица6[Games],0)","v":0},{"$f":"IFERROR((Таблица6[Profit]/Таблица6[Buy-in])*100,0)","v":0},{"$f":"IFERROR((COUNTIFS(Таблица1[Date],Таблица6[2019],Таблица1[Winnings],\">0\")/Таблица6[Games])*100,0)","v":0},{"$f":"SUMIFS(Таблица1[Total Hands],Таблица1[Date],Таблица6[[#This Row],[2019]])","v":0},{"$f":"IFERROR(SUMIFS(Таблица1[bb/101],Таблица1[Date],Таблица6[[#This Row],[2019]])/Таблица6[[#This Row],[Hand]],0)","v":0},{"$f":"IFERROR(SUMIFS(Таблица1[EV bb/101],Таблица1[Date],Таблица6[[#This Row],[2019]])/Таблица6[[#This Row],[Hand]],0)","v":0},{"$f":"SUMIFS(Таблица1[Net Winnings],Таблица1[Date],Таблица6[2019])","v":0},{"$f":"IFERROR(Таблица6[[#This Row],[Profit]]/Таблица6[[#This Row],[Games]],0)","v":0}]
[null,"2019-08-19",{"$f":"COUNTIFS(Таблица1[Date],Таблица6[[#This Row],[2019]])+SUMIFS(Таблица1[Re-entry],Таблица1[Date],Таблица6[[#This Row],[2019]])","v":0},{"$f":"SUMIFS(Таблица1[Total Buy-In],Таблица1[Date],Таблица6[[#This Row],[2019]])","v":0},{"$f":"IFERROR(Таблица6[Buy-in]/Таблица6[Games],0)","v":0},{"$f":"IFERROR((Таблица6[Profit]/Таблица6[Buy-in])*100,0)","v":0},{"$f":"IFERROR((COUNTIFS(Таблица1[Date],Таблица6[2019],Таблица1[Winnings],\">0\")/Таблица6[Games])*100,0)","v":0},{"$f":"SUMIFS(Таблица1[Total Hands],Таблица1[Date],Таблица6[[#This Row],[2019]])","v":0},{"$f":"IFERROR(SUMIFS(Таблица1[bb/101],Таблица1[Date],Таблица6[[#This Row],[2019]])/Таблица6[[#This Row],[Hand]],0)","v":0},{"$f":"IFERROR(SUMIFS(Таблица1[EV bb/101],Таблица1[Date],Таблица6[[#This Row],[2019]])/Таблица6[[#This Row],[Hand]],0)","v":0},{"$f":"SUMIFS(Таблица1[Net Winnings],Таблица1[Date],Таблица6[2019])","v":0},{"$f":"IFERROR(Таблица6[[#This Row],[Profit]]/Таблица6[[#This Row],[Games]],0)","v":0}]
[null,"2019-08-20",{"$f":"COUNTIFS(Таблица1[Date],Таблица6[[#This Row],[2019]])+SUMIFS(Таблица1[Re-entry],Таблица1[Date],Таблица6[[#This Row],[2019]])","v":0},{"$f":"SUMIFS(Таблица1[Total Buy-In],Таблица1[Date],Таблица6[[#This Row],[2019]])","v":0},{"$f":"IFERROR(Таблица6[Buy-in]/Таблица6[Games],0)","v":0},{"$f":"IFERROR((Таблица6[Profit]/Таблица6[Buy-in])*100,0)","v":0},{"$f":"IFERROR((COUNTIFS(Таблица1[Date],Таблица6[2019],Таблица1[Winnings],\">0\")/Таблица6[Games])*100,0)","v":0},{"$f":"SUMIFS(Таблица1[Total Hands],Таблица1[Date],Таблица6[[#This Row],[2019]])","v":0},{"$f":"IFERROR(SUMIFS(Таблица1[bb/101],Таблица1[Date],Таблица6[[#This Row],[2019]])/Таблица6[[#This Row],[Hand]],0)","v":0},{"$f":"IFERROR(SUMIFS(Таблица1[EV bb/101],Таблица1[Date],Таблица6[[#This Row],[2019]])/Таблица6[[#This Row],[Hand]],0)","v":0},{"$f":"SUMIFS(Таблица1[Net Winnings],Таблица1[Date],Таблица6[2019])","v":0},{"$f":"IFERROR(Таблица6[[#This Row],[Profit]]/Таблица6[[#This Row],[Games]],0)","v":0}]
[null,"2019-08-21",{"$f":"COUNTIFS(Таблица1[Date],Таблица6[[#This Row],[2019]])+SUMIFS(Таблица1[Re-entry],Таблица1[Date],Таблица6[[#This Row],[2019]])","v":0},{"$f":"SUMIFS(Таблица1[Total Buy-In],Таблица1[Date],Таблица6[[#This Row],[2019]])","v":0},{"$f":"IFERROR(Таблица6[Buy-in]/Таблица6[Games],0)","v":0},{"$f":"IFERROR((Таблица6[Profit]/Таблица6[Buy-in])*100,0)","v":0},{"$f":"IFERROR((COUNTIFS(Таблица1[Date],Таблица6[2019],Таблица1[Winnings],\">0\")/Таблица6[Games])*100,0)","v":0},{"$f":"SUMIFS(Таблица1[Total Hands],Таблица1[Date],Таблица6[[#This Row],[2019]])","v":0},{"$f":"IFERROR(SUMIFS(Таблица1[bb/101],Таблица1[Date],Таблица6[[#This Row],[2019]])/Таблица6[[#This Row],[Hand]],0)","v":0},{"$f":"IFERROR(SUMIFS(Таблица1[EV bb/101],Таблица1[Date],Таблица6[[#This Row],[2019]])/Таблица6[[#This Row],[Hand]],0)","v":0},{"$f":"SUMIFS(Таблица1[Net Winnings],Таблица1[Date],Таблица6[2019])","v":0},{"$f":"IFERROR(Таблица6[[#This Row],[Profit]]/Таблица6[[#This Row],[Games]],0)","v":0}]
[null,"2019-08-22",{"$f":"COUNTIFS(Таблица1[Date],Таблица6[[#This Row],[2019]])+SUMIFS(Таблица1[Re-entry],Таблица1[Date],Таблица6[[#This Row],[2019]])","v":0},{"$f":"SUMIFS(Таблица1[Total Buy-In],Таблица1[Date],Таблица6[[#This Row],[2019]])","v":0},{"$f":"IFERROR(Таблица6[Buy-in]/Таблица6[Games],0)","v":0},{"$f":"IFERROR((Таблица6[Profit]/Таблица6[Buy-in])*100,0)","v":0},{"$f":"IFERROR((COUNTIFS(Таблица1[Date],Таблица6[2019],Таблица1[Winnings],\">0\")/Таблица6[Games])*100,0)","v":0},{"$f":"SUMIFS(Таблица1[Total Hands],Таблица1[Date],Таблица6[[#This Row],[2019]])","v":0},{"$f":"IFERROR(SUMIFS(Таблица1[bb/101],Таблица1[Date],Таблица6[[#This Row],[2019]])/Таблица6[[#This Row],[Hand]],0)","v":0},{"$f":"IFERROR(SUMIFS(Таблица1[EV bb/101],Таблица1[Date],Таблица6[[#This Row],[2019]])/Таблица6[[#This Row],[Hand]],0)","v":0},{"$f":"SUMIFS(Таблица1[Net Winnings],Таблица1[Date],Таблица6[2019])","v":0},{"$f":"IFERROR(Таблица6[[#This Row],[Profit]]/Таблица6[[#This Row],[Games]],0)","v":0}]
[null,"2019-08-23",{"$f":"COUNTIFS(Таблица1[Date],Таблица6[[#This Row],[2019]])+SUMIFS(Таблица1[Re-entry],Таблица1[Date],Таблица6[[#This Row],[2019]])","v":0},{"$f":"SUMIFS(Таблица1[Total Buy-In],Таблица1[Date],Таблица6[[#This Row],[2019]])","v":0},{"$f":"IFERROR(Таблица6[Buy-in]/Таблица6[Games],0)","v":0},{"$f":"IFERROR((Таблица6[Profit]/Таблица6[Buy-in])*100,0)","v":0},{"$f":"IFERROR((COUNTIFS(Таблица1[Date],Таблица6[2019],Таблица1[Winnings],\">0\")/Таблица6[Games])*100,0)","v":0},{"$f":"SUMIFS(Таблица1[Total Hands],Таблица1[Date],Таблица6[[#This Row],[2019]])","v":0},{"$f":"IFERROR(SUMIFS(Таблица1[bb/101],Таблица1[Date],Таблица6[[#This Row],[2019]])/Таблица6[[#This Row],[Hand]],0)","v":0},{"$f":"IFERROR(SUMIFS(Таблица1[EV bb/101],Таблица1[Date],Таблица6[[#This Row],[2019]])/Таблица6[[#This Row],[Hand]],0)","v":0},{"$f":"SUMIFS(Таблица1[Net Winnings],Таблица1[Date],Таблица6[2019])","v":0},{"$f":"IFERROR(Таблица6[[#This Row],[Profit]]/Таблица6[[#This Row],[Games]],0)","v":0}]
[null,"2019-08-24",{"$f":"COUNTIFS(Таблица1[Date],Таблица6[[#This Row],[2019]])+SUMIFS(Таблица1[Re-entry],Таблица1[Date],Таблица6[[#This Row],[2019]])","v":0},{"$f":"SUMIFS(Таблица1[Total Buy-In],Таблица1[Date],Таблица6[[#This Row],[2019]])","v":0},{"$f":"IFERROR(Таблица6[Buy-in]/Таблица6[Games],0)","v":0},{"$f":"IFERROR((Таблица6[Profit]/Таблица6[Buy-in])*100,0)","v":0},{"$f":"IFERROR((COUNTIFS(Таблица1[Date],Таблица6[2019],Таблица1[Winnings],\">0\")/Таблица6[Games])*100,0)","v":0},{"$f":"SUMIFS(Таблица1[Total Hands],Таблица1[Date],Таблица6[[#This Row],[2019]])","v":0},{"$f":"IFERROR(SUMIFS(Таблица1[bb/101],Таблица1[Date],Таблица6[[#This Row],[2019]])/Таблица6[[#This Row],[Hand]],0)","v":0},{"$f":"IFERROR(SUMIFS(Таблица1[EV bb/101],Таблица1[Date],Таблица6[[#This Row],[2019]])/Таблица6[[#This Row],[Hand]],0)","v":0},{"$f":"SUMIFS(Таблица1[Net Winnings],Таблица1[Date],Таблица6[2019])","v":0},{"$f":"IFERROR(Таблица6[[#This Row],[Profit]]/Таблица6[[#This Row],[Games]],0)","v":0}]
[null,"2019-08-25",{"$f":"COUNTIFS(Таблица1[Date],Таблица6[[#This Row],[2019]])+SUMIFS(Таблица1[Re-entry],Таблица1[Date],Таблица6[[#This Row],[2019]])","v":0},{"$f":"SUMIFS(Таблица1[Total Buy-In],Таблица1[Date],Таблица6[[#This Row],[2019]])","v":0},{"$f":"IFERROR(Таблица6[Buy-in]/Таблица6[Games],0)","v":0},{"$f":"IFERROR((Таблица6[Profit]/Таблица6[Buy-in])*100,0)","v":0},{"$f":"IFERROR((COUNTIFS(Таблица1[Date],Таблица6[2019],Таблица1[Winnings],\">0\")/Таблица6[Games])*100,0)","v":0},{"$f":"SUMIFS(Таблица1[Total Hands],Таблица1[Date],Таблица6[[#This Row],[2019]])","v":0},{"$f":"IFERROR(SUMIFS(Таблица1[bb/101],Таблица1[Date],Таблица6[[#This Row],[2019]])/Таблица6[[#This Row],[Hand]],0)","v":0},{"$f":"IFERROR(SUMIFS(Таблица1[EV bb/101],Таблица1[Date],Таблица6[[#This Row],[2019]])/Таблица6[[#This Row],[Hand]],0)","v":0},{"$f":"SUMIFS(Таблица1[Net Winnings],Таблица1[Date],Таблица6[2019])","v":0},{"$f":"IFERROR(Таблица6[[#This Row],[Profit]]/Таблица6[[#This Row],[Games]],0)","v":0}]
[null,"2019-08-26",{"$f":"COUNTIFS(Таблица1[Date],Таблица6[[#This Row],[2019]])+SUMIFS(Таблица1[Re-entry],Таблица1[Date],Таблица6[[#This Row],[2019]])","v":0},{"$f":"SUMIFS(Таблица1[Total Buy-In],Таблица1[Date],Таблица6[[#This Row],[2019]])","v":0},{"$f":"IFERROR(Таблица6[Buy-in]/Таблица6[Games],0)","v":0},{"$f":"IFERROR((Таблица6[Profit]/Таблица6[Buy-in])*100,0)","v":0},{"$f":"IFERROR((COUNTIFS(Таблица1[Date],Таблица6[2019],Таблица1[Winnings],\">0\")/Таблица6[Games])*100,0)","v":0},{"$f":"SUMIFS(Таблица1[Total Hands],Таблица1[Date],Таблица6[[#This Row],[2019]])","v":0},{"$f":"IFERROR(SUMIFS(Таблица1[bb/101],Таблица1[Date],Таблица6[[#This Row],[2019]])/Таблица6[[#This Row],[Hand]],0)","v":0},{"$f":"IFERROR(SUMIFS(Таблица1[EV bb/101],Таблица1[Date],Таблица6[[#This Row],[2019]])/Таблица6[[#This Row],[Hand]],0)","v":0},{"$f":"SUMIFS(Таблица1[Net Winnings],Таблица1[Date],Таблица6[2019])","v":0},{"$f":"IFERROR(Таблица6[[#This Row],[Profit]]/Таблица6[[#This Row],[Games]],0)","v":0}]
[null,"2019-08-27",{"$f":"COUNTIFS(Таблица1[Date],Таблица6[[#This Row],[2019]])+SUMIFS(Таблица1[Re-entry],Таблица1[Date],Таблица6[[#This Row],[2019]])","v":0},{"$f":"SUMIFS(Таблица1[Total Buy-In],Таблица1[Date],Таблица6[[#This Row],[2019]])","v":0},{"$f":"IFERROR(Таблица6[Buy-in]/Таблица6[Games],0)","v":0},{"$f":"IFERROR((Таблица6[Profit]/Таблица6[Buy-in])*100,0)","v":0},{"$f":"IFERROR((COUNTIFS(Таблица1[Date],Таблица6[2019],Таблица1[Winnings],\">0\")/Таблица6[Games])*100,0)","v":0},{"$f":"SUMIFS(Таблица1[Total Hands],Таблица1[Date],Таблица6[[#This Row],[2019]])","v":0},{"$f":"IFERROR(SUMIFS(Таблица1[bb/101],Таблица1[Date],Таблица6[[#This Row],[2019]])/Таблица6[[#This Row],[Hand]],0)","v":0},{"$f":"IFERROR(SUMIFS(Таблица1[EV bb/101],Таблица1[Date],Таблица6[[#This Row],[2019]])/Таблица6[[#This Row],[Hand]],0)","v":0},{"$f":"SUMIFS(Таблица1[Net Winnings],Таблица1[Date],Таблица6[2019])","v":0},{"$f":"IFERROR(Таблица6[[#This Row],[Profit]]/Таблица6[[#This Row],[Games]],0)","v":0}]
[null,"2019-08-28",{"$f":"COUNTIFS(Таблица1[Date],Таблица6[[#This Row],[2019]])+SUMIFS(Таблица1[Re-entry],Таблица1[Date],Таблица6[[#This Row],[2019]])","v":0},{"$f":"SUMIFS(Таблица1[Total Buy-In],Таблица1[Date],Таблица6[[#This Row],[2019]])","v":0},{"$f":"IFERROR(Таблица6[Buy-in]/Таблица6[Games],0)","v":0},{"$f":"IFERROR((Таблица6[Profit]/Таблица6[Buy-in])*100,0)","v":0},{"$f":"IFERROR((COUNTIFS(Таблица1[Date],Таблица6[2019],Таблица1[Winnings],\">0\")/Таблица6[Games])*100,0)","v":0},{"$f":"SUMIFS(Таблица1[Total Hands],Таблица1[Date],Таблица6[[#This Row],[2019]])","v":0},{"$f":"IFERROR(SUMIFS(Таблица1[bb/101],Таблица1[Date],Таблица6[[#This Row],[2019]])/Таблица6[[#This Row],[Hand]],0)","v":0},{"$f":"IFERROR(SUMIFS(Таблица1[EV bb/101],Таблица1[Date],Таблица6[[#This Row],[2019]])/Таблица6[[#This Row],[Hand]],0)","v":0},{"$f":"SUMIFS(Таблица1[Net Winnings],Таблица1[Date],Таблица6[2019])","v":0},{"$f":"IFERROR(Таблица6[[#This Row],[Profit]]/Таблица6[[#This Row],[Games]],0)","v":0}]
[null,"2019-08-29",{"$f":"COUNTIFS(Таблица1[Date],Таблица6[[#This Row],[2019]])+SUMIFS(Таблица1[Re-entry],Таблица1[Date],Таблица6[[#This Row],[2019]])","v":0},{"$f":"SUMIFS(Таблица1[Total Buy-In],Таблица1[Date],Таблица6[[#This Row],[2019]])","v":0},{"$f":"IFERROR(Таблица6[Buy-in]/Таблица6[Games],0)","v":0},{"$f":"IFERROR((Таблица6[Profit]/Таблица6[Buy-in])*100,0)","v":0},{"$f":"IFERROR((COUNTIFS(Таблица1[Date],Таблица6[2019],Таблица1[Winnings],\">0\")/Таблица6[Games])*100,0)","v":0},{"$f":"SUMIFS(Таблица1[Total Hands],Таблица1[Date],Таблица6[[#This Row],[2019]])","v":0},{"$f":"IFERROR(SUMIFS(Таблица1[bb/101],Таблица1[Date],Таблица6[[#This Row],[2019]])/Таблица6[[#This Row],[Hand]],0)","v":0},{"$f":"IFERROR(SUMIFS(Таблица1[EV bb/101],Таблица1[Date],Таблица6[[#This Row],[2019]])/Таблица6[[#This Row],[Hand]],0)","v":0},{"$f":"SUMIFS(Таблица1[Net Winnings],Таблица1[Date],Таблица6[2019])","v":0},{"$f":"IFERROR(Таблица6[[#This Row],[Profit]]/Таблица6[[#This Row],[Games]],0)","v":0}]
[null,"2019-08-30",{"$f":"COUNTIFS(Таблица1[Date],Таблица6[[#This Row],[2019]])+SUMIFS(Таблица1[Re-entry],Таблица1[Date],Таблица6[[#This Row],[2019]])","v":0},{"$f":"SUMIFS(Таблица1[Total Buy-In],Таблица1[Date],Таблица6[[#This Row],[2019]])","v":0},{"$f":"IFERROR(Таблица6[Buy-in]/Таблица6[Games],0)","v":0},{"$f":"IFERROR((Таблица6[Profit]/Таблица6[Buy-in])*100,0)","v":0},{"$f":"IFERROR((COUNTIFS(Таблица1[Date],Таблица6[2019],Таблица1[Winnings],\">0\")/Таблица6[Games])*100,0)","v":0},{"$f":"SUMIFS(Таблица1[Total Hands],Таблица1[Date],Таблица6[[#This Row],[2019]])","v":0},{"$f":"IFERROR(SUMIFS(Таблица1[bb/101],Таблица1[Date],Таблица6[[#This Row],[2019]])/Таблица6[[#This Row],[Hand]],0)","v":0},{"$f":"IFERROR(SUMIFS(Таблица1[EV bb/101],Таблица1[Date],Таблица6[[#This Row],[2019]])/Таблица6[[#This Row],[Hand]],0)","v":0},{"$f":"SUMIFS(Таблица1[Net Winnings],Таблица1[Date],Таблица6[2019])","v":0},{"$f":"IFERROR(Таблица6[[#This Row],[Profit]]/Таблица6[[#This Row],[Games]],0)","v":0}]
[null,"2019-08-31",{"$f":"COUNTIFS(Таблица1[Date],Таблица6[[#This Row],[2019]])+SUMIFS(Таблица1[Re-entry],Таблица1[Date],Таблица6[[#This Row],[2019]])","v":0},{"$f":"SUMIFS(Таблица1[Total Buy-In],Таблица1[Date],Таблица6[[#This Row],[2019]])","v":0},{"$f":"IFERROR(Таблица6[Buy-in]/Таблица6[Games],0)","v":0},{"$f":"IFERROR((Таблица6[Profit]/Таблица6[Buy-in])*100,0)","v":0},{"$f":"IFERROR((COUNTIFS(Таблица1[Date],Таблица6[2019],Таблица1[Winnings],\">0\")/Таблица6[Games])*100,0)","v":0},{"$f":"SUMIFS(Таблица1[Total Hands],Таблица1[Date],Таблица6[[#This Row],[2019]])","v":0},{"$f":"IFERROR(SUMIFS(Таблица1[bb/101],Таблица1[Date],Таблица6[[#This Row],[2019]])/Таблица6[[#This Row],[Hand]],0)","v":0},{"$f":"IFERROR(SUMIFS(Таблица1[EV bb/101],Таблица1[Date],Таблица6[[#This Row],[2019]])/Таблица6[[#This Row],[Hand]],0)","v":0},{"$f":"SUMIFS(Таблица1[Net Winnings],Таблица1[Date],Таблица6[2019])","v":0},{"$f":"IFERROR(Таблица6[[#This Row],[Profit]]/Таблица6[[#This Row],[Games]],0)","v":0}]

{"sheet":"неделя","index":5,"n_rows":56,"n_cols":14,"rows_kept":56,"cut":false,"hidden":false,"merged":[]}
[]
[]
[null,null,null,"2019","Games","Buy-in","ABI","Roi","Itm","Hand","bb/100","EV bb/100","Profit","Pr/Game"]
[null,null,null,1,{"$f":"COUNTIFS(Таблица1[No],Таблица69171116[[#This Row],[2019]])+SUMIFS(Таблица1[Re-entry],Таблица1[No],Таблица69171116[[#This Row],[2019]])","v":0},{"$f":"SUMIFS(Таблица1[Total Buy-In],Таблица1[No],Таблица69171116[[#This Row],[2019]])","v":0},{"$f":"IFERROR(Таблица69171116[Buy-in]/Таблица69171116[Games],0)","v":0},{"$f":"IFERROR((Таблица69171116[Profit]/Таблица69171116[Buy-in])*100,0)","v":0},{"$f":"IFERROR((COUNTIFS(Таблица1[No],Таблица69171116[2019],Таблица1[Winnings],\">0\")/Таблица69171116[Games])*100,0)","v":0},{"$f":"SUMIFS(Таблица1[Total Hands],Таблица1[No],Таблица69171116[[#This Row],[2019]])","v":0},{"$f":"IFERROR(SUMIFS(Таблица1[bb/101],Таблица1[No],Таблица69171116[[#This Row],[2019]])/Таблица69171116[[#This Row],[Hand]],0)","v":0},{"$f":"IFERROR(SUMIFS(Таблица1[EV bb/101],Таблица1[No],Таблица69171116[[#This Row],[2019]])/Таблица69171116[[#This Row],[Hand]],0)","v":0},{"$f":"SUMIFS(Таблица1[Net Winnings],Таблица1[No],Таблица69171116[2019])","v":0},{"$f":"IFERROR(Таблица69171116[[#This Row],[Profit]]/Таблица69171116[[#This Row],[Games]],0)","v":0}]
[null,null,null,2,{"$f":"COUNTIFS(Таблица1[No],Таблица69171116[[#This Row],[2019]])+SUMIFS(Таблица1[Re-entry],Таблица1[No],Таблица69171116[[#This Row],[2019]])","v":0},{"$f":"SUMIFS(Таблица1[Total Buy-In],Таблица1[No],Таблица69171116[[#This Row],[2019]])","v":0},{"$f":"IFERROR(Таблица69171116[Buy-in]/Таблица69171116[Games],0)","v":0},{"$f":"IFERROR((Таблица69171116[Profit]/Таблица69171116[Buy-in])*100,0)","v":0},{"$f":"IFERROR((COUNTIFS(Таблица1[No],Таблица69171116[2019],Таблица1[Winnings],\">0\")/Таблица69171116[Games])*100,0)","v":0},{"$f":"SUMIFS(Таблица1[Total Hands],Таблица1[No],Таблица69171116[[#This Row],[2019]])","v":0},{"$f":"IFERROR(SUMIFS(Таблица1[bb/101],Таблица1[No],Таблица69171116[[#This Row],[2019]])/Таблица69171116[[#This Row],[Hand]],0)","v":0},{"$f":"IFERROR(SUMIFS(Таблица1[EV bb/101],Таблица1[No],Таблица69171116[[#This Row],[2019]])/Таблица69171116[[#This Row],[Hand]],0)","v":0},{"$f":"SUMIFS(Таблица1[Net Winnings],Таблица1[No],Таблица69171116[2019])","v":0},{"$f":"IFERROR(Таблица69171116[[#This Row],[Profit]]/Таблица69171116[[#This Row],[Games]],0)","v":0}]
[null,null,null,3,{"$f":"COUNTIFS(Таблица1[No],Таблица69171116[[#This Row],[2019]])+SUMIFS(Таблица1[Re-entry],Таблица1[No],Таблица69171116[[#This Row],[2019]])","v":0},{"$f":"SUMIFS(Таблица1[Total Buy-In],Таблица1[No],Таблица69171116[[#This Row],[2019]])","v":0},{"$f":"IFERROR(Таблица69171116[Buy-in]/Таблица69171116[Games],0)","v":0},{"$f":"IFERROR((Таблица69171116[Profit]/Таблица69171116[Buy-in])*100,0)","v":0},{"$f":"IFERROR((COUNTIFS(Таблица1[No],Таблица69171116[2019],Таблица1[Winnings],\">0\")/Таблица69171116[Games])*100,0)","v":0},{"$f":"SUMIFS(Таблица1[Total Hands],Таблица1[No],Таблица69171116[[#This Row],[2019]])","v":0},{"$f":"IFERROR(SUMIFS(Таблица1[bb/101],Таблица1[No],Таблица69171116[[#This Row],[2019]])/Таблица69171116[[#This Row],[Hand]],0)","v":0},{"$f":"IFERROR(SUMIFS(Таблица1[EV bb/101],Таблица1[No],Таблица69171116[[#This Row],[2019]])/Таблица69171116[[#This Row],[Hand]],0)","v":0},{"$f":"SUMIFS(Таблица1[Net Winnings],Таблица1[No],Таблица69171116[2019])","v":0},{"$f":"IFERROR(Таблица69171116[[#This Row],[Profit]]/Таблица69171116[[#This Row],[Games]],0)","v":0}]
[null,null,null,4,{"$f":"COUNTIFS(Таблица1[No],Таблица69171116[[#This Row],[2019]])+SUMIFS(Таблица1[Re-entry],Таблица1[No],Таблица69171116[[#This Row],[2019]])","v":0},{"$f":"SUMIFS(Таблица1[Total Buy-In],Таблица1[No],Таблица69171116[[#This Row],[2019]])","v":0},{"$f":"IFERROR(Таблица69171116[Buy-in]/Таблица69171116[Games],0)","v":0},{"$f":"IFERROR((Таблица69171116[Profit]/Таблица69171116[Buy-in])*100,0)","v":0},{"$f":"IFERROR((COUNTIFS(Таблица1[No],Таблица69171116[2019],Таблица1[Winnings],\">0\")/Таблица69171116[Games])*100,0)","v":0},{"$f":"SUMIFS(Таблица1[Total Hands],Таблица1[No],Таблица69171116[[#This Row],[2019]])","v":0},{"$f":"IFERROR(SUMIFS(Таблица1[bb/101],Таблица1[No],Таблица69171116[[#This Row],[2019]])/Таблица69171116[[#This Row],[Hand]],0)","v":0},{"$f":"IFERROR(SUMIFS(Таблица1[EV bb/101],Таблица1[No],Таблица69171116[[#This Row],[2019]])/Таблица69171116[[#This Row],[Hand]],0)","v":0},{"$f":"SUMIFS(Таблица1[Net Winnings],Таблица1[No],Таблица69171116[2019])","v":0},{"$f":"IFERROR(Таблица69171116[[#This Row],[Profit]]/Таблица69171116[[#This Row],[Games]],0)","v":0}]
[null,null,null,5,{"$f":"COUNTIFS(Таблица1[No],Таблица69171116[[#This Row],[2019]])+SUMIFS(Таблица1[Re-entry],Таблица1[No],Таблица69171116[[#This Row],[2019]])","v":0},{"$f":"SUMIFS(Таблица1[Total Buy-In],Таблица1[No],Таблица69171116[[#This Row],[2019]])","v":0},{"$f":"IFERROR(Таблица69171116[Buy-in]/Таблица69171116[Games],0)","v":0},{"$f":"IFERROR((Таблица69171116[Profit]/Таблица69171116[Buy-in])*100,0)","v":0},{"$f":"IFERROR((COUNTIFS(Таблица1[No],Таблица69171116[2019],Таблица1[Winnings],\">0\")/Таблица69171116[Games])*100,0)","v":0},{"$f":"SUMIFS(Таблица1[Total Hands],Таблица1[No],Таблица69171116[[#This Row],[2019]])","v":0},{"$f":"IFERROR(SUMIFS(Таблица1[bb/101],Таблица1[No],Таблица69171116[[#This Row],[2019]])/Таблица69171116[[#This Row],[Hand]],0)","v":0},{"$f":"IFERROR(SUMIFS(Таблица1[EV bb/101],Таблица1[No],Таблица69171116[[#This Row],[2019]])/Таблица69171116[[#This Row],[Hand]],0)","v":0},{"$f":"SUMIFS(Таблица1[Net Winnings],Таблица1[No],Таблица69171116[2019])","v":0},{"$f":"IFERROR(Таблица69171116[[#This Row],[Profit]]/Таблица69171116[[#This Row],[Games]],0)","v":0}]
[null,null,null,6,{"$f":"COUNTIFS(Таблица1[No],Таблица69171116[[#This Row],[2019]])+SUMIFS(Таблица1[Re-entry],Таблица1[No],Таблица69171116[[#This Row],[2019]])","v":0},{"$f":"SUMIFS(Таблица1[Total Buy-In],Таблица1[No],Таблица69171116[[#This Row],[2019]])","v":0},{"$f":"IFERROR(Таблица69171116[Buy-in]/Таблица69171116[Games],0)","v":0},{"$f":"IFERROR((Таблица69171116[Profit]/Таблица69171116[Buy-in])*100,0)","v":0},{"$f":"IFERROR((COUNTIFS(Таблица1[No],Таблица69171116[2019],Таблица1[Winnings],\">0\")/Таблица69171116[Games])*100,0)","v":0},{"$f":"SUMIFS(Таблица1[Total Hands],Таблица1[No],Таблица69171116[[#This Row],[2019]])","v":0},{"$f":"IFERROR(SUMIFS(Таблица1[bb/101],Таблица1[No],Таблица69171116[[#This Row],[2019]])/Таблица69171116[[#This Row],[Hand]],0)","v":0},{"$f":"IFERROR(SUMIFS(Таблица1[EV bb/101],Таблица1[No],Таблица69171116[[#This Row],[2019]])/Таблица69171116[[#This Row],[Hand]],0)","v":0},{"$f":"SUMIFS(Таблица1[Net Winnings],Таблица1[No],Таблица69171116[2019])","v":0},{"$f":"IFERROR(Таблица69171116[[#This Row],[Profit]]/Таблица69171116[[#This Row],[Games]],0)","v":0}]
[null,null,null,7,{"$f":"COUNTIFS(Таблица1[No],Таблица69171116[[#This Row],[2019]])+SUMIFS(Таблица1[Re-entry],Таблица1[No],Таблица69171116[[#This Row],[2019]])","v":0},{"$f":"SUMIFS(Таблица1[Total Buy-In],Таблица1[No],Таблица69171116[[#This Row],[2019]])","v":0},{"$f":"IFERROR(Таблица69171116[Buy-in]/Таблица69171116[Games],0)","v":0},{"$f":"IFERROR((Таблица69171116[Profit]/Таблица69171116[Buy-in])*100,0)","v":0},{"$f":"IFERROR((COUNTIFS(Таблица1[No],Таблица69171116[2019],Таблица1[Winnings],\">0\")/Таблица69171116[Games])*100,0)","v":0},{"$f":"SUMIFS(Таблица1[Total Hands],Таблица1[No],Таблица69171116[[#This Row],[2019]])","v":0},{"$f":"IFERROR(SUMIFS(Таблица1[bb/101],Таблица1[No],Таблица69171116[[#This Row],[2019]])/Таблица69171116[[#This Row],[Hand]],0)","v":0},{"$f":"IFERROR(SUMIFS(Таблица1[EV bb/101],Таблица1[No],Таблица69171116[[#This Row],[2019]])/Таблица69171116[[#This Row],[Hand]],0)","v":0},{"$f":"SUMIFS(Таблица1[Net Winnings],Таблица1[No],Таблица69171116[2019])","v":0},{"$f":"IFERROR(Таблица69171116[[#This Row],[Profit]]/Таблица69171116[[#This Row],[Games]],0)","v":0}]
[null,null,null,8,{"$f":"COUNTIFS(Таблица1[No],Таблица69171116[[#This Row],[2019]])+SUMIFS(Таблица1[Re-entry],Таблица1[No],Таблица69171116[[#This Row],[2019]])","v":0},{"$f":"SUMIFS(Таблица1[Total Buy-In],Таблица1[No],Таблица69171116[[#This Row],[2019]])","v":0},{"$f":"IFERROR(Таблица69171116[Buy-in]/Таблица69171116[Games],0)","v":0},{"$f":"IFERROR((Таблица69171116[Profit]/Таблица69171116[Buy-in])*100,0)","v":0},{"$f":"IFERROR((COUNTIFS(Таблица1[No],Таблица69171116[2019],Таблица1[Winnings],\">0\")/Таблица69171116[Games])*100,0)","v":0},{"$f":"SUMIFS(Таблица1[Total Hands],Таблица1[No],Таблица69171116[[#This Row],[2019]])","v":0},{"$f":"IFERROR(SUMIFS(Таблица1[bb/101],Таблица1[No],Таблица69171116[[#This Row],[2019]])/Таблица69171116[[#This Row],[Hand]],0)","v":0},{"$f":"IFERROR(SUMIFS(Таблица1[EV bb/101],Таблица1[No],Таблица69171116[[#This Row],[2019]])/Таблица69171116[[#This Row],[Hand]],0)","v":0},{"$f":"SUMIFS(Таблица1[Net Winnings],Таблица1[No],Таблица69171116[2019])","v":0},{"$f":"IFERROR(Таблица69171116[[#This Row],[Profit]]/Таблица69171116[[#This Row],[Games]],0)","v":0}]
[null,null,null,9,{"$f":"COUNTIFS(Таблица1[No],Таблица69171116[[#This Row],[2019]])+SUMIFS(Таблица1[Re-entry],Таблица1[No],Таблица69171116[[#This Row],[2019]])","v":0},{"$f":"SUMIFS(Таблица1[Total Buy-In],Таблица1[No],Таблица69171116[[#This Row],[2019]])","v":0},{"$f":"IFERROR(Таблица69171116[Buy-in]/Таблица69171116[Games],0)","v":0},{"$f":"IFERROR((Таблица69171116[Profit]/Таблица69171116[Buy-in])*100,0)","v":0},{"$f":"IFERROR((COUNTIFS(Таблица1[No],Таблица69171116[2019],Таблица1[Winnings],\">0\")/Таблица69171116[Games])*100,0)","v":0},{"$f":"SUMIFS(Таблица1[Total Hands],Таблица1[No],Таблица69171116[[#This Row],[2019]])","v":0},{"$f":"IFERROR(SUMIFS(Таблица1[bb/101],Таблица1[No],Таблица69171116[[#This Row],[2019]])/Таблица69171116[[#This Row],[Hand]],0)","v":0},{"$f":"IFERROR(SUMIFS(Таблица1[EV bb/101],Таблица1[No],Таблица69171116[[#This Row],[2019]])/Таблица69171116[[#This Row],[Hand]],0)","v":0},{"$f":"SUMIFS(Таблица1[Net Winnings],Таблица1[No],Таблица69171116[2019])","v":0},{"$f":"IFERROR(Таблица69171116[[#This Row],[Profit]]/Таблица69171116[[#This Row],[Games]],0)","v":0}]
[null,null,null,10,{"$f":"COUNTIFS(Таблица1[No],Таблица69171116[[#This Row],[2019]])+SUMIFS(Таблица1[Re-entry],Таблица1[No],Таблица69171116[[#This Row],[2019]])","v":0},{"$f":"SUMIFS(Таблица1[Total Buy-In],Таблица1[No],Таблица69171116[[#This Row],[2019]])","v":0},{"$f":"IFERROR(Таблица69171116[Buy-in]/Таблица69171116[Games],0)","v":0},{"$f":"IFERROR((Таблица69171116[Profit]/Таблица69171116[Buy-in])*100,0)","v":0},{"$f":"IFERROR((COUNTIFS(Таблица1[No],Таблица69171116[2019],Таблица1[Winnings],\">0\")/Таблица69171116[Games])*100,0)","v":0},{"$f":"SUMIFS(Таблица1[Total Hands],Таблица1[No],Таблица69171116[[#This Row],[2019]])","v":0},{"$f":"IFERROR(SUMIFS(Таблица1[bb/101],Таблица1[No],Таблица69171116[[#This Row],[2019]])/Таблица69171116[[#This Row],[Hand]],0)","v":0},{"$f":"IFERROR(SUMIFS(Таблица1[EV bb/101],Таблица1[No],Таблица69171116[[#This Row],[2019]])/Таблица69171116[[#This Row],[Hand]],0)","v":0},{"$f":"SUMIFS(Таблица1[Net Winnings],Таблица1[No],Таблица69171116[2019])","v":0},{"$f":"IFERROR(Таблица69171116[[#This Row],[Profit]]/Таблица69171116[[#This Row],[Games]],0)","v":0}]
[null,null,null,11,{"$f":"COUNTIFS(Таблица1[No],Таблица69171116[[#This Row],[2019]])+SUMIFS(Таблица1[Re-entry],Таблица1[No],Таблица69171116[[#This Row],[2019]])","v":0},{"$f":"SUMIFS(Таблица1[Total Buy-In],Таблица1[No],Таблица69171116[[#This Row],[2019]])","v":0},{"$f":"IFERROR(Таблица69171116[Buy-in]/Таблица69171116[Games],0)","v":0},{"$f":"IFERROR((Таблица69171116[Profit]/Таблица69171116[Buy-in])*100,0)","v":0},{"$f":"IFERROR((COUNTIFS(Таблица1[No],Таблица69171116[2019],Таблица1[Winnings],\">0\")/Таблица69171116[Games])*100,0)","v":0},{"$f":"SUMIFS(Таблица1[Total Hands],Таблица1[No],Таблица69171116[[#This Row],[2019]])","v":0},{"$f":"IFERROR(SUMIFS(Таблица1[bb/101],Таблица1[No],Таблица69171116[[#This Row],[2019]])/Таблица69171116[[#This Row],[Hand]],0)","v":0},{"$f":"IFERROR(SUMIFS(Таблица1[EV bb/101],Таблица1[No],Таблица69171116[[#This Row],[2019]])/Таблица69171116[[#This Row],[Hand]],0)","v":0},{"$f":"SUMIFS(Таблица1[Net Winnings],Таблица1[No],Таблица69171116[2019])","v":0},{"$f":"IFERROR(Таблица69171116[[#This Row],[Profit]]/Таблица69171116[[#This Row],[Games]],0)","v":0}]
[null,null,null,12,{"$f":"COUNTIFS(Таблица1[No],Таблица69171116[[#This Row],[2019]])+SUMIFS(Таблица1[Re-entry],Таблица1[No],Таблица69171116[[#This Row],[2019]])","v":0},{"$f":"SUMIFS(Таблица1[Total Buy-In],Таблица1[No],Таблица69171116[[#This Row],[2019]])","v":0},{"$f":"IFERROR(Таблица69171116[Buy-in]/Таблица69171116[Games],0)","v":0},{"$f":"IFERROR((Таблица69171116[Profit]/Таблица69171116[Buy-in])*100,0)","v":0},{"$f":"IFERROR((COUNTIFS(Таблица1[No],Таблица69171116[2019],Таблица1[Winnings],\">0\")/Таблица69171116[Games])*100,0)","v":0},{"$f":"SUMIFS(Таблица1[Total Hands],Таблица1[No],Таблица69171116[[#This Row],[2019]])","v":0},{"$f":"IFERROR(SUMIFS(Таблица1[bb/101],Таблица1[No],Таблица69171116[[#This Row],[2019]])/Таблица69171116[[#This Row],[Hand]],0)","v":0},{"$f":"IFERROR(SUMIFS(Таблица1[EV bb/101],Таблица1[No],Таблица69171116[[#This Row],[2019]])/Таблица69171116[[#This Row],[Hand]],0)","v":0},{"$f":"SUMIFS(Таблица1[Net Winnings],Таблица1[No],Таблица69171116[2019])","v":0},{"$f":"IFERROR(Таблица69171116[[#This Row],[Profit]]/Таблица69171116[[#This Row],[Games]],0)","v":0}]
[null,null,null,13,{"$f":"COUNTIFS(Таблица1[No],Таблица69171116[[#This Row],[2019]])+SUMIFS(Таблица1[Re-entry],Таблица1[No],Таблица69171116[[#This Row],[2019]])","v":0},{"$f":"SUMIFS(Таблица1[Total Buy-In],Таблица1[No],Таблица69171116[[#This Row],[2019]])","v":0},{"$f":"IFERROR(Таблица69171116[Buy-in]/Таблица69171116[Games],0)","v":0},{"$f":"IFERROR((Таблица69171116[Profit]/Таблица69171116[Buy-in])*100,0)","v":0},{"$f":"IFERROR((COUNTIFS(Таблица1[No],Таблица69171116[2019],Таблица1[Winnings],\">0\")/Таблица69171116[Games])*100,0)","v":0},{"$f":"SUMIFS(Таблица1[Total Hands],Таблица1[No],Таблица69171116[[#This Row],[2019]])","v":0},{"$f":"IFERROR(SUMIFS(Таблица1[bb/101],Таблица1[No],Таблица69171116[[#This Row],[2019]])/Таблица69171116[[#This Row],[Hand]],0)","v":0},{"$f":"IFERROR(SUMIFS(Таблица1[EV bb/101],Таблица1[No],Таблица69171116[[#This Row],[2019]])/Таблица69171116[[#This Row],[Hand]],0)","v":0},{"$f":"SUMIFS(Таблица1[Net Winnings],Таблица1[No],Таблица69171116[2019])","v":0},{"$f":"IFERROR(Таблица69171116[[#This Row],[Profit]]/Таблица69171116[[#This Row],[Games]],0)","v":0}]
[null,null,null,14,{"$f":"COUNTIFS(Таблица1[No],Таблица69171116[[#This Row],[2019]])+SUMIFS(Таблица1[Re-entry],Таблица1[No],Таблица69171116[[#This Row],[2019]])","v":0},{"$f":"SUMIFS(Таблица1[Total Buy-In],Таблица1[No],Таблица69171116[[#This Row],[2019]])","v":0},{"$f":"IFERROR(Таблица69171116[Buy-in]/Таблица69171116[Games],0)","v":0},{"$f":"IFERROR((Таблица69171116[Profit]/Таблица69171116[Buy-in])*100,0)","v":0},{"$f":"IFERROR((COUNTIFS(Таблица1[No],Таблица69171116[2019],Таблица1[Winnings],\">0\")/Таблица69171116[Games])*100,0)","v":0},{"$f":"SUMIFS(Таблица1[Total Hands],Таблица1[No],Таблица69171116[[#This Row],[2019]])","v":0},{"$f":"IFERROR(SUMIFS(Таблица1[bb/101],Таблица1[No],Таблица69171116[[#This Row],[2019]])/Таблица69171116[[#This Row],[Hand]],0)","v":0},{"$f":"IFERROR(SUMIFS(Таблица1[EV bb/101],Таблица1[No],Таблица69171116[[#This Row],[2019]])/Таблица69171116[[#This Row],[Hand]],0)","v":0},{"$f":"SUMIFS(Таблица1[Net Winnings],Таблица1[No],Таблица69171116[2019])","v":0},{"$f":"IFERROR(Таблица69171116[[#This Row],[Profit]]/Таблица69171116[[#This Row],[Games]],0)","v":0}]
[null,null,null,15,{"$f":"COUNTIFS(Таблица1[No],Таблица69171116[[#This Row],[2019]])+SUMIFS(Таблица1[Re-entry],Таблица1[No],Таблица69171116[[#This Row],[2019]])","v":0},{"$f":"SUMIFS(Таблица1[Total Buy-In],Таблица1[No],Таблица69171116[[#This Row],[2019]])","v":0},{"$f":"IFERROR(Таблица69171116[Buy-in]/Таблица69171116[Games],0)","v":0},{"$f":"IFERROR((Таблица69171116[Profit]/Таблица69171116[Buy-in])*100,0)","v":0},{"$f":"IFERROR((COUNTIFS(Таблица1[No],Таблица69171116[2019],Таблица1[Winnings],\">0\")/Таблица69171116[Games])*100,0)","v":0},{"$f":"SUMIFS(Таблица1[Total Hands],Таблица1[No],Таблица69171116[[#This Row],[2019]])","v":0},{"$f":"IFERROR(SUMIFS(Таблица1[bb/101],Таблица1[No],Таблица69171116[[#This Row],[2019]])/Таблица69171116[[#This Row],[Hand]],0)","v":0},{"$f":"IFERROR(SUMIFS(Таблица1[EV bb/101],Таблица1[No],Таблица69171116[[#This Row],[2019]])/Таблица69171116[[#This Row],[Hand]],0)","v":0},{"$f":"SUMIFS(Таблица1[Net Winnings],Таблица1[No],Таблица69171116[2019])","v":0},{"$f":"IFERROR(Таблица69171116[[#This Row],[Profit]]/Таблица69171116[[#This Row],[Games]],0)","v":0}]
[null,null,null,16,{"$f":"COUNTIFS(Таблица1[No],Таблица69171116[[#This Row],[2019]])+SUMIFS(Таблица1[Re-entry],Таблица1[No],Таблица69171116[[#This Row],[2019]])","v":0},{"$f":"SUMIFS(Таблица1[Total Buy-In],Таблица1[No],Таблица69171116[[#This Row],[2019]])","v":0},{"$f":"IFERROR(Таблица69171116[Buy-in]/Таблица69171116[Games],0)","v":0},{"$f":"IFERROR((Таблица69171116[Profit]/Таблица69171116[Buy-in])*100,0)","v":0},{"$f":"IFERROR((COUNTIFS(Таблица1[No],Таблица69171116[2019],Таблица1[Winnings],\">0\")/Таблица69171116[Games])*100,0)","v":0},{"$f":"SUMIFS(Таблица1[Total Hands],Таблица1[No],Таблица69171116[[#This Row],[2019]])","v":0},{"$f":"IFERROR(SUMIFS(Таблица1[bb/101],Таблица1[No],Таблица69171116[[#This Row],[2019]])/Таблица69171116[[#This Row],[Hand]],0)","v":0},{"$f":"IFERROR(SUMIFS(Таблица1[EV bb/101],Таблица1[No],Таблица69171116[[#This Row],[2019]])/Таблица69171116[[#This Row],[Hand]],0)","v":0},{"$f":"SUMIFS(Таблица1[Net Winnings],Таблица1[No],Таблица69171116[2019])","v":0},{"$f":"IFERROR(Таблица69171116[[#This Row],[Profit]]/Таблица69171116[[#This Row],[Games]],0)","v":0}]
[null,null,null,17,{"$f":"COUNTIFS(Таблица1[No],Таблица69171116[[#This Row],[2019]])+SUMIFS(Таблица1[Re-entry],Таблица1[No],Таблица69171116[[#This Row],[2019]])","v":0},{"$f":"SUMIFS(Таблица1[Total Buy-In],Таблица1[No],Таблица69171116[[#This Row],[2019]])","v":0},{"$f":"IFERROR(Таблица69171116[Buy-in]/Таблица69171116[Games],0)","v":0},{"$f":"IFERROR((Таблица69171116[Profit]/Таблица69171116[Buy-in])*100,0)","v":0},{"$f":"IFERROR((COUNTIFS(Таблица1[No],Таблица69171116[2019],Таблица1[Winnings],\">0\")/Таблица69171116[Games])*100,0)","v":0},{"$f":"SUMIFS(Таблица1[Total Hands],Таблица1[No],Таблица69171116[[#This Row],[2019]])","v":0},{"$f":"IFERROR(SUMIFS(Таблица1[bb/101],Таблица1[No],Таблица69171116[[#This Row],[2019]])/Таблица69171116[[#This Row],[Hand]],0)","v":0},{"$f":"IFERROR(SUMIFS(Таблица1[EV bb/101],Таблица1[No],Таблица69171116[[#This Row],[2019]])/Таблица69171116[[#This Row],[Hand]],0)","v":0},{"$f":"SUMIFS(Таблица1[Net Winnings],Таблица1[No],Таблица69171116[2019])","v":0},{"$f":"IFERROR(Таблица69171116[[#This Row],[Profit]]/Таблица69171116[[#This Row],[Games]],0)","v":0}]
[null,null,null,18,{"$f":"COUNTIFS(Таблица1[No],Таблица69171116[[#This Row],[2019]])+SUMIFS(Таблица1[Re-entry],Таблица1[No],Таблица69171116[[#This Row],[2019]])","v":0},{"$f":"SUMIFS(Таблица1[Total Buy-In],Таблица1[No],Таблица69171116[[#This Row],[2019]])","v":0},{"$f":"IFERROR(Таблица69171116[Buy-in]/Таблица69171116[Games],0)","v":0},{"$f":"IFERROR((Таблица69171116[Profit]/Таблица69171116[Buy-in])*100,0)","v":0},{"$f":"IFERROR((COUNTIFS(Таблица1[No],Таблица69171116[2019],Таблица1[Winnings],\">0\")/Таблица69171116[Games])*100,0)","v":0},{"$f":"SUMIFS(Таблица1[Total Hands],Таблица1[No],Таблица69171116[[#This Row],[2019]])","v":0},{"$f":"IFERROR(SUMIFS(Таблица1[bb/101],Таблица1[No],Таблица69171116[[#This Row],[2019]])/Таблица69171116[[#This Row],[Hand]],0)","v":0},{"$f":"IFERROR(SUMIFS(Таблица1[EV bb/101],Таблица1[No],Таблица69171116[[#This Row],[2019]])/Таблица69171116[[#This Row],[Hand]],0)","v":0},{"$f":"SUMIFS(Таблица1[Net Winnings],Таблица1[No],Таблица69171116[2019])","v":0},{"$f":"IFERROR(Таблица69171116[[#This Row],[Profit]]/Таблица69171116[[#This Row],[Games]],0)","v":0}]
[null,null,null,19,{"$f":"COUNTIFS(Таблица1[No],Таблица69171116[[#This Row],[2019]])+SUMIFS(Таблица1[Re-entry],Таблица1[No],Таблица69171116[[#This Row],[2019]])","v":0},{"$f":"SUMIFS(Таблица1[Total Buy-In],Таблица1[No],Таблица69171116[[#This Row],[2019]])","v":0},{"$f":"IFERROR(Таблица69171116[Buy-in]/Таблица69171116[Games],0)","v":0},{"$f":"IFERROR((Таблица69171116[Profit]/Таблица69171116[Buy-in])*100,0)","v":0},{"$f":"IFERROR((COUNTIFS(Таблица1[No],Таблица69171116[2019],Таблица1[Winnings],\">0\")/Таблица69171116[Games])*100,0)","v":0},{"$f":"SUMIFS(Таблица1[Total Hands],Таблица1[No],Таблица69171116[[#This Row],[2019]])","v":0},{"$f":"IFERROR(SUMIFS(Таблица1[bb/101],Таблица1[No],Таблица69171116[[#This Row],[2019]])/Таблица69171116[[#This Row],[Hand]],0)","v":0},{"$f":"IFERROR(SUMIFS(Таблица1[EV bb/101],Таблица1[No],Таблица69171116[[#This Row],[2019]])/Таблица69171116[[#This Row],[Hand]],0)","v":0},{"$f":"SUMIFS(Таблица1[Net Winnings],Таблица1[No],Таблица69171116[2019])","v":0},{"$f":"IFERROR(Таблица69171116[[#This Row],[Profit]]/Таблица69171116[[#This Row],[Games]],0)","v":0}]
[null,null,null,20,{"$f":"COUNTIFS(Таблица1[No],Таблица69171116[[#This Row],[2019]])+SUMIFS(Таблица1[Re-entry],Таблица1[No],Таблица69171116[[#This Row],[2019]])","v":0},{"$f":"SUMIFS(Таблица1[Total Buy-In],Таблица1[No],Таблица69171116[[#This Row],[2019]])","v":0},{"$f":"IFERROR(Таблица69171116[Buy-in]/Таблица69171116[Games],0)","v":0},{"$f":"IFERROR((Таблица69171116[Profit]/Таблица69171116[Buy-in])*100,0)","v":0},{"$f":"IFERROR((COUNTIFS(Таблица1[No],Таблица69171116[2019],Таблица1[Winnings],\">0\")/Таблица69171116[Games])*100,0)","v":0},{"$f":"SUMIFS(Таблица1[Total Hands],Таблица1[No],Таблица69171116[[#This Row],[2019]])","v":0},{"$f":"IFERROR(SUMIFS(Таблица1[bb/101],Таблица1[No],Таблица69171116[[#This Row],[2019]])/Таблица69171116[[#This Row],[Hand]],0)","v":0},{"$f":"IFERROR(SUMIFS(Таблица1[EV bb/101],Таблица1[No],Таблица69171116[[#This Row],[2019]])/Таблица69171116[[#This Row],[Hand]],0)","v":0},{"$f":"SUMIFS(Таблица1[Net Winnings],Таблица1[No],Таблица69171116[2019])","v":0},{"$f":"IFERROR(Таблица69171116[[#This Row],[Profit]]/Таблица69171116[[#This Row],[Games]],0)","v":0}]
[null,null,null,21,{"$f":"COUNTIFS(Таблица1[No],Таблица69171116[[#This Row],[2019]])+SUMIFS(Таблица1[Re-entry],Таблица1[No],Таблица69171116[[#This Row],[2019]])","v":0},{"$f":"SUMIFS(Таблица1[Total Buy-In],Таблица1[No],Таблица69171116[[#This Row],[2019]])","v":0},{"$f":"IFERROR(Таблица69171116[Buy-in]/Таблица69171116[Games],0)","v":0},{"$f":"IFERROR((Таблица69171116[Profit]/Таблица69171116[Buy-in])*100,0)","v":0},{"$f":"IFERROR((COUNTIFS(Таблица1[No],Таблица69171116[2019],Таблица1[Winnings],\">0\")/Таблица69171116[Games])*100,0)","v":0},{"$f":"SUMIFS(Таблица1[Total Hands],Таблица1[No],Таблица69171116[[#This Row],[2019]])","v":0},{"$f":"IFERROR(SUMIFS(Таблица1[bb/101],Таблица1[No],Таблица69171116[[#This Row],[2019]])/Таблица69171116[[#This Row],[Hand]],0)","v":0},{"$f":"IFERROR(SUMIFS(Таблица1[EV bb/101],Таблица1[No],Таблица69171116[[#This Row],[2019]])/Таблица69171116[[#This Row],[Hand]],0)","v":0},{"$f":"SUMIFS(Таблица1[Net Winnings],Таблица1[No],Таблица69171116[2019])","v":0},{"$f":"IFERROR(Таблица69171116[[#This Row],[Profit]]/Таблица69171116[[#This Row],[Games]],0)","v":0}]
[null,null,null,22,{"$f":"COUNTIFS(Таблица1[No],Таблица69171116[[#This Row],[2019]])+SUMIFS(Таблица1[Re-entry],Таблица1[No],Таблица69171116[[#This Row],[2019]])","v":0},{"$f":"SUMIFS(Таблица1[Total Buy-In],Таблица1[No],Таблица69171116[[#This Row],[2019]])","v":0},{"$f":"IFERROR(Таблица69171116[Buy-in]/Таблица69171116[Games],0)","v":0},{"$f":"IFERROR((Таблица69171116[Profit]/Таблица69171116[Buy-in])*100,0)","v":0},{"$f":"IFERROR((COUNTIFS(Таблица1[No],Таблица69171116[2019],Таблица1[Winnings],\">0\")/Таблица69171116[Games])*100,0)","v":0},{"$f":"SUMIFS(Таблица1[Total Hands],Таблица1[No],Таблица69171116[[#This Row],[2019]])","v":0},{"$f":"IFERROR(SUMIFS(Таблица1[bb/101],Таблица1[No],Таблица69171116[[#This Row],[2019]])/Таблица69171116[[#This Row],[Hand]],0)","v":0},{"$f":"IFERROR(SUMIFS(Таблица1[EV bb/101],Таблица1[No],Таблица69171116[[#This Row],[2019]])/Таблица69171116[[#This Row],[Hand]],0)","v":0},{"$f":"SUMIFS(Таблица1[Net Winnings],Таблица1[No],Таблица69171116[2019])","v":0},{"$f":"IFERROR(Таблица69171116[[#This Row],[Profit]]/Таблица69171116[[#This Row],[Games]],0)","v":0}]
[null,null,null,23,{"$f":"COUNTIFS(Таблица1[No],Таблица69171116[[#This Row],[2019]])+SUMIFS(Таблица1[Re-entry],Таблица1[No],Таблица69171116[[#This Row],[2019]])","v":0},{"$f":"SUMIFS(Таблица1[Total Buy-In],Таблица1[No],Таблица69171116[[#This Row],[2019]])","v":0},{"$f":"IFERROR(Таблица69171116[Buy-in]/Таблица69171116[Games],0)","v":0},{"$f":"IFERROR((Таблица69171116[Profit]/Таблица69171116[Buy-in])*100,0)","v":0},{"$f":"IFERROR((COUNTIFS(Таблица1[No],Таблица69171116[2019],Таблица1[Winnings],\">0\")/Таблица69171116[Games])*100,0)","v":0},{"$f":"SUMIFS(Таблица1[Total Hands],Таблица1[No],Таблица69171116[[#This Row],[2019]])","v":0},{"$f":"IFERROR(SUMIFS(Таблица1[bb/101],Таблица1[No],Таблица69171116[[#This Row],[2019]])/Таблица69171116[[#This Row],[Hand]],0)","v":0},{"$f":"IFERROR(SUMIFS(Таблица1[EV bb/101],Таблица1[No],Таблица69171116[[#This Row],[2019]])/Таблица69171116[[#This Row],[Hand]],0)","v":0},{"$f":"SUMIFS(Таблица1[Net Winnings],Таблица1[No],Таблица69171116[2019])","v":0},{"$f":"IFERROR(Таблица69171116[[#This Row],[Profit]]/Таблица69171116[[#This Row],[Games]],0)","v":0}]
[null,null,null,24,{"$f":"COUNTIFS(Таблица1[No],Таблица69171116[[#This Row],[2019]])+SUMIFS(Таблица1[Re-entry],Таблица1[No],Таблица69171116[[#This Row],[2019]])","v":0},{"$f":"SUMIFS(Таблица1[Total Buy-In],Таблица1[No],Таблица69171116[[#This Row],[2019]])","v":0},{"$f":"IFERROR(Таблица69171116[Buy-in]/Таблица69171116[Games],0)","v":0},{"$f":"IFERROR((Таблица69171116[Profit]/Таблица69171116[Buy-in])*100,0)","v":0},{"$f":"IFERROR((COUNTIFS(Таблица1[No],Таблица69171116[2019],Таблица1[Winnings],\">0\")/Таблица69171116[Games])*100,0)","v":0},{"$f":"SUMIFS(Таблица1[Total Hands],Таблица1[No],Таблица69171116[[#This Row],[2019]])","v":0},{"$f":"IFERROR(SUMIFS(Таблица1[bb/101],Таблица1[No],Таблица69171116[[#This Row],[2019]])/Таблица69171116[[#This Row],[Hand]],0)","v":0},{"$f":"IFERROR(SUMIFS(Таблица1[EV bb/101],Таблица1[No],Таблица69171116[[#This Row],[2019]])/Таблица69171116[[#This Row],[Hand]],0)","v":0},{"$f":"SUMIFS(Таблица1[Net Winnings],Таблица1[No],Таблица69171116[2019])","v":0},{"$f":"IFERROR(Таблица69171116[[#This Row],[Profit]]/Таблица69171116[[#This Row],[Games]],0)","v":0}]
[null,null,null,25,{"$f":"COUNTIFS(Таблица1[No],Таблица69171116[[#This Row],[2019]])+SUMIFS(Таблица1[Re-entry],Таблица1[No],Таблица69171116[[#This Row],[2019]])","v":0},{"$f":"SUMIFS(Таблица1[Total Buy-In],Таблица1[No],Таблица69171116[[#This Row],[2019]])","v":0},{"$f":"IFERROR(Таблица69171116[Buy-in]/Таблица69171116[Games],0)","v":0},{"$f":"IFERROR((Таблица69171116[Profit]/Таблица69171116[Buy-in])*100,0)","v":0},{"$f":"IFERROR((COUNTIFS(Таблица1[No],Таблица69171116[2019],Таблица1[Winnings],\">0\")/Таблица69171116[Games])*100,0)","v":0},{"$f":"SUMIFS(Таблица1[Total Hands],Таблица1[No],Таблица69171116[[#This Row],[2019]])","v":0},{"$f":"IFERROR(SUMIFS(Таблица1[bb/101],Таблица1[No],Таблица69171116[[#This Row],[2019]])/Таблица69171116[[#This Row],[Hand]],0)","v":0},{"$f":"IFERROR(SUMIFS(Таблица1[EV bb/101],Таблица1[No],Таблица69171116[[#This Row],[2019]])/Таблица69171116[[#This Row],[Hand]],0)","v":0},{"$f":"SUMIFS(Таблица1[Net Winnings],Таблица1[No],Таблица69171116[2019])","v":0},{"$f":"IFERROR(Таблица69171116[[#This Row],[Profit]]/Таблица69171116[[#This Row],[Games]],0)","v":0}]
[null,null,null,26,{"$f":"COUNTIFS(Таблица1[No],Таблица69171116[[#This Row],[2019]])+SUMIFS(Таблица1[Re-entry],Таблица1[No],Таблица69171116[[#This Row],[2019]])","v":0},{"$f":"SUMIFS(Таблица1[Total Buy-In],Таблица1[No],Таблица69171116[[#This Row],[2019]])","v":0},{"$f":"IFERROR(Таблица69171116[Buy-in]/Таблица69171116[Games],0)","v":0},{"$f":"IFERROR((Таблица69171116[Profit]/Таблица69171116[Buy-in])*100,0)","v":0},{"$f":"IFERROR((COUNTIFS(Таблица1[No],Таблица69171116[2019],Таблица1[Winnings],\">0\")/Таблица69171116[Games])*100,0)","v":0},{"$f":"SUMIFS(Таблица1[Total Hands],Таблица1[No],Таблица69171116[[#This Row],[2019]])","v":0},{"$f":"IFERROR(SUMIFS(Таблица1[bb/101],Таблица1[No],Таблица69171116[[#This Row],[2019]])/Таблица69171116[[#This Row],[Hand]],0)","v":0},{"$f":"IFERROR(SUMIFS(Таблица1[EV bb/101],Таблица1[No],Таблица69171116[[#This Row],[2019]])/Таблица69171116[[#This Row],[Hand]],0)","v":0},{"$f":"SUMIFS(Таблица1[Net Winnings],Таблица1[No],Таблица69171116[2019])","v":0},{"$f":"IFERROR(Таблица69171116[[#This Row],[Profit]]/Таблица69171116[[#This Row],[Games]],0)","v":0}]
[null,null,null,27,{"$f":"COUNTIFS(Таблица1[No],Таблица69171116[[#This Row],[2019]])+SUMIFS(Таблица1[Re-entry],Таблица1[No],Таблица69171116[[#This Row],[2019]])","v":4},{"$f":"SUMIFS(Таблица1[Total Buy-In],Таблица1[No],Таблица69171116[[#This Row],[2019]])","v":1},{"$f":"IFERROR(Таблица69171116[Buy-in]/Таблица69171116[Games],0)","v":0.25},{"$f":"IFERROR((Таблица69171116[Profit]/Таблица69171116[Buy-in])*100,0)","v":223},{"$f":"IFERROR((COUNTIFS(Таблица1[No],Таблица69171116[2019],Таблица1[Winnings],\">0\")/Таблица69171116[Games])*100,0)","v":25},{"$f":"SUMIFS(Таблица1[Total Hands],Таблица1[No],Таблица69171116[[#This Row],[2019]])","v":416},{"$f":"IFERROR(SUMIFS(Таблица1[bb/101],Таблица1[No],Таблица69171116[[#This Row],[2019]])/Таблица69171116[[#This Row],[Hand]],0)","v":18.658221153846153},{"$f":"IFERROR(SUMIFS(Таблица1[EV bb/101],Таблица1[No],Таблица69171116[[#This Row],[2019]])/Таблица69171116[[#This Row],[Hand]],0)","v":5.9914182692307678},{"$f":"SUMIFS(Таблица1[Net Winnings],Таблица1[No],Таблица69171116[2019])","v":2.23},{"$f":"IFERROR(Таблица69171116[[#This Row],[Profit]]/Таблица69171116[[#This Row],[Games]],0)","v":0.5575}]
[null,null,null,28,{"$f":"COUNTIFS(Таблица1[No],Таблица69171116[[#This Row],[2019]])+SUMIFS(Таблица1[Re-entry],Таблица1[No],Таблица69171116[[#This Row],[2019]])","v":0},{"$f":"SUMIFS(Таблица1[Total Buy-In],Таблица1[No],Таблица69171116[[#This Row],[2019]])","v":0},{"$f":"IFERROR(Таблица69171116[Buy-in]/Таблица69171116[Games],0)","v":0},{"$f":"IFERROR((Таблица69171116[Profit]/Таблица69171116[Buy-in])*100,0)","v":0},{"$f":"IFERROR((COUNTIFS(Таблица1[No],Таблица69171116[2019],Таблица1[Winnings],\">0\")/Таблица69171116[Games])*100,0)","v":0},{"$f":"SUMIFS(Таблица1[Total Hands],Таблица1[No],Таблица69171116[[#This Row],[2019]])","v":0},{"$f":"IFERROR(SUMIFS(Таблица1[bb/101],Таблица1[No],Таблица69171116[[#This Row],[2019]])/Таблица69171116[[#This Row],[Hand]],0)","v":0},{"$f":"IFERROR(SUMIFS(Таблица1[EV bb/101],Таблица1[No],Таблица69171116[[#This Row],[2019]])/Таблица69171116[[#This Row],[Hand]],0)","v":0},{"$f":"SUMIFS(Таблица1[Net Winnings],Таблица1[No],Таблица69171116[2019])","v":0},{"$f":"IFERROR(Таблица69171116[[#This Row],[Profit]]/Таблица69171116[[#This Row],[Games]],0)","v":0}]
[null,null,null,29,{"$f":"COUNTIFS(Таблица1[No],Таблица69171116[[#This Row],[2019]])+SUMIFS(Таблица1[Re-entry],Таблица1[No],Таблица69171116[[#This Row],[2019]])","v":0},{"$f":"SUMIFS(Таблица1[Total Buy-In],Таблица1[No],Таблица69171116[[#This Row],[2019]])","v":0},{"$f":"IFERROR(Таблица69171116[Buy-in]/Таблица69171116[Games],0)","v":0},{"$f":"IFERROR((Таблица69171116[Profit]/Таблица69171116[Buy-in])*100,0)","v":0},{"$f":"IFERROR((COUNTIFS(Таблица1[No],Таблица69171116[2019],Таблица1[Winnings],\">0\")/Таблица69171116[Games])*100,0)","v":0},{"$f":"SUMIFS(Таблица1[Total Hands],Таблица1[No],Таблица69171116[[#This Row],[2019]])","v":0},{"$f":"IFERROR(SUMIFS(Таблица1[bb/101],Таблица1[No],Таблица69171116[[#This Row],[2019]])/Таблица69171116[[#This Row],[Hand]],0)","v":0},{"$f":"IFERROR(SUMIFS(Таблица1[EV bb/101],Таблица1[No],Таблица69171116[[#This Row],[2019]])/Таблица69171116[[#This Row],[Hand]],0)","v":0},{"$f":"SUMIFS(Таблица1[Net Winnings],Таблица1[No],Таблица69171116[2019])","v":0},{"$f":"IFERROR(Таблица69171116[[#This Row],[Profit]]/Таблица69171116[[#This Row],[Games]],0)","v":0}]
[null,null,null,30,{"$f":"COUNTIFS(Таблица1[No],Таблица69171116[[#This Row],[2019]])+SUMIFS(Таблица1[Re-entry],Таблица1[No],Таблица69171116[[#This Row],[2019]])","v":0},{"$f":"SUMIFS(Таблица1[Total Buy-In],Таблица1[No],Таблица69171116[[#This Row],[2019]])","v":0},{"$f":"IFERROR(Таблица69171116[Buy-in]/Таблица69171116[Games],0)","v":0},{"$f":"IFERROR((Таблица69171116[Profit]/Таблица69171116[Buy-in])*100,0)","v":0},{"$f":"IFERROR((COUNTIFS(Таблица1[No],Таблица69171116[2019],Таблица1[Winnings],\">0\")/Таблица69171116[Games])*100,0)","v":0},{"$f":"SUMIFS(Таблица1[Total Hands],Таблица1[No],Таблица69171116[[#This Row],[2019]])","v":0},{"$f":"IFERROR(SUMIFS(Таблица1[bb/101],Таблица1[No],Таблица69171116[[#This Row],[2019]])/Таблица69171116[[#This Row],[Hand]],0)","v":0},{"$f":"IFERROR(SUMIFS(Таблица1[EV bb/101],Таблица1[No],Таблица69171116[[#This Row],[2019]])/Таблица69171116[[#This Row],[Hand]],0)","v":0},{"$f":"SUMIFS(Таблица1[Net Winnings],Таблица1[No],Таблица69171116[2019])","v":0},{"$f":"IFERROR(Таблица69171116[[#This Row],[Profit]]/Таблица69171116[[#This Row],[Games]],0)","v":0}]
[null,null,null,31,{"$f":"COUNTIFS(Таблица1[No],Таблица69171116[[#This Row],[2019]])+SUMIFS(Таблица1[Re-entry],Таблица1[No],Таблица69171116[[#This Row],[2019]])","v":0},{"$f":"SUMIFS(Таблица1[Total Buy-In],Таблица1[No],Таблица69171116[[#This Row],[2019]])","v":0},{"$f":"IFERROR(Таблица69171116[Buy-in]/Таблица69171116[Games],0)","v":0},{"$f":"IFERROR((Таблица69171116[Profit]/Таблица69171116[Buy-in])*100,0)","v":0},{"$f":"IFERROR((COUNTIFS(Таблица1[No],Таблица69171116[2019],Таблица1[Winnings],\">0\")/Таблица69171116[Games])*100,0)","v":0},{"$f":"SUMIFS(Таблица1[Total Hands],Таблица1[No],Таблица69171116[[#This Row],[2019]])","v":0},{"$f":"IFERROR(SUMIFS(Таблица1[bb/101],Таблица1[No],Таблица69171116[[#This Row],[2019]])/Таблица69171116[[#This Row],[Hand]],0)","v":0},{"$f":"IFERROR(SUMIFS(Таблица1[EV bb/101],Таблица1[No],Таблица69171116[[#This Row],[2019]])/Таблица69171116[[#This Row],[Hand]],0)","v":0},{"$f":"SUMIFS(Таблица1[Net Winnings],Таблица1[No],Таблица69171116[2019])","v":0},{"$f":"IFERROR(Таблица69171116[[#This Row],[Profit]]/Таблица69171116[[#This Row],[Games]],0)","v":0}]
[null,null,null,32,{"$f":"COUNTIFS(Таблица1[No],Таблица69171116[[#This Row],[2019]])+SUMIFS(Таблица1[Re-entry],Таблица1[No],Таблица69171116[[#This Row],[2019]])","v":0},{"$f":"SUMIFS(Таблица1[Total Buy-In],Таблица1[No],Таблица69171116[[#This Row],[2019]])","v":0},{"$f":"IFERROR(Таблица69171116[Buy-in]/Таблица69171116[Games],0)","v":0},{"$f":"IFERROR((Таблица69171116[Profit]/Таблица69171116[Buy-in])*100,0)","v":0},{"$f":"IFERROR((COUNTIFS(Таблица1[No],Таблица69171116[2019],Таблица1[Winnings],\">0\")/Таблица69171116[Games])*100,0)","v":0},{"$f":"SUMIFS(Таблица1[Total Hands],Таблица1[No],Таблица69171116[[#This Row],[2019]])","v":0},{"$f":"IFERROR(SUMIFS(Таблица1[bb/101],Таблица1[No],Таблица69171116[[#This Row],[2019]])/Таблица69171116[[#This Row],[Hand]],0)","v":0},{"$f":"IFERROR(SUMIFS(Таблица1[EV bb/101],Таблица1[No],Таблица69171116[[#This Row],[2019]])/Таблица69171116[[#This Row],[Hand]],0)","v":0},{"$f":"SUMIFS(Таблица1[Net Winnings],Таблица1[No],Таблица69171116[2019])","v":0},{"$f":"IFERROR(Таблица69171116[[#This Row],[Profit]]/Таблица69171116[[#This Row],[Games]],0)","v":0}]
[null,null,null,33,{"$f":"COUNTIFS(Таблица1[No],Таблица69171116[[#This Row],[2019]])+SUMIFS(Таблица1[Re-entry],Таблица1[No],Таблица69171116[[#This Row],[2019]])","v":0},{"$f":"SUMIFS(Таблица1[Total Buy-In],Таблица1[No],Таблица69171116[[#This Row],[2019]])","v":0},{"$f":"IFERROR(Таблица69171116[Buy-in]/Таблица69171116[Games],0)","v":0},{"$f":"IFERROR((Таблица69171116[Profit]/Таблица69171116[Buy-in])*100,0)","v":0},{"$f":"IFERROR((COUNTIFS(Таблица1[No],Таблица69171116[2019],Таблица1[Winnings],\">0\")/Таблица69171116[Games])*100,0)","v":0},{"$f":"SUMIFS(Таблица1[Total Hands],Таблица1[No],Таблица69171116[[#This Row],[2019]])","v":0},{"$f":"IFERROR(SUMIFS(Таблица1[bb/101],Таблица1[No],Таблица69171116[[#This Row],[2019]])/Таблица69171116[[#This Row],[Hand]],0)","v":0},{"$f":"IFERROR(SUMIFS(Таблица1[EV bb/101],Таблица1[No],Таблица69171116[[#This Row],[2019]])/Таблица69171116[[#This Row],[Hand]],0)","v":0},{"$f":"SUMIFS(Таблица1[Net Winnings],Таблица1[No],Таблица69171116[2019])","v":0},{"$f":"IFERROR(Таблица69171116[[#This Row],[Profit]]/Таблица69171116[[#This Row],[Games]],0)","v":0}]
[null,null,null,34,{"$f":"COUNTIFS(Таблица1[No],Таблица69171116[[#This Row],[2019]])+SUMIFS(Таблица1[Re-entry],Таблица1[No],Таблица69171116[[#This Row],[2019]])","v":0},{"$f":"SUMIFS(Таблица1[Total Buy-In],Таблица1[No],Таблица69171116[[#This Row],[2019]])","v":0},{"$f":"IFERROR(Таблица69171116[Buy-in]/Таблица69171116[Games],0)","v":0},{"$f":"IFERROR((Таблица69171116[Profit]/Таблица69171116[Buy-in])*100,0)","v":0},{"$f":"IFERROR((COUNTIFS(Таблица1[No],Таблица69171116[2019],Таблица1[Winnings],\">0\")/Таблица69171116[Games])*100,0)","v":0},{"$f":"SUMIFS(Таблица1[Total Hands],Таблица1[No],Таблица69171116[[#This Row],[2019]])","v":0},{"$f":"IFERROR(SUMIFS(Таблица1[bb/101],Таблица1[No],Таблица69171116[[#This Row],[2019]])/Таблица69171116[[#This Row],[Hand]],0)","v":0},{"$f":"IFERROR(SUMIFS(Таблица1[EV bb/101],Таблица1[No],Таблица69171116[[#This Row],[2019]])/Таблица69171116[[#This Row],[Hand]],0)","v":0},{"$f":"SUMIFS(Таблица1[Net Winnings],Таблица1[No],Таблица69171116[2019])","v":0},{"$f":"IFERROR(Таблица69171116[[#This Row],[Profit]]/Таблица69171116[[#This Row],[Games]],0)","v":0}]
[null,null,null,35,{"$f":"COUNTIFS(Таблица1[No],Таблица69171116[[#This Row],[2019]])+SUMIFS(Таблица1[Re-entry],Таблица1[No],Таблица69171116[[#This Row],[2019]])","v":0},{"$f":"SUMIFS(Таблица1[Total Buy-In],Таблица1[No],Таблица69171116[[#This Row],[2019]])","v":0},{"$f":"IFERROR(Таблица69171116[Buy-in]/Таблица69171116[Games],0)","v":0},{"$f":"IFERROR((Таблица69171116[Profit]/Таблица69171116[Buy-in])*100,0)","v":0},{"$f":"IFERROR((COUNTIFS(Таблица1[No],Таблица69171116[2019],Таблица1[Winnings],\">0\")/Таблица69171116[Games])*100,0)","v":0},{"$f":"SUMIFS(Таблица1[Total Hands],Таблица1[No],Таблица69171116[[#This Row],[2019]])","v":0},{"$f":"IFERROR(SUMIFS(Таблица1[bb/101],Таблица1[No],Таблица69171116[[#This Row],[2019]])/Таблица69171116[[#This Row],[Hand]],0)","v":0},{"$f":"IFERROR(SUMIFS(Таблица1[EV bb/101],Таблица1[No],Таблица69171116[[#This Row],[2019]])/Таблица69171116[[#This Row],[Hand]],0)","v":0},{"$f":"SUMIFS(Таблица1[Net Winnings],Таблица1[No],Таблица69171116[2019])","v":0},{"$f":"IFERROR(Таблица69171116[[#This Row],[Profit]]/Таблица69171116[[#This Row],[Games]],0)","v":0}]
[null,null,null,36,{"$f":"COUNTIFS(Таблица1[No],Таблица69171116[[#This Row],[2019]])+SUMIFS(Таблица1[Re-entry],Таблица1[No],Таблица69171116[[#This Row],[2019]])","v":0},{"$f":"SUMIFS(Таблица1[Total Buy-In],Таблица1[No],Таблица69171116[[#This Row],[2019]])","v":0},{"$f":"IFERROR(Таблица69171116[Buy-in]/Таблица69171116[Games],0)","v":0},{"$f":"IFERROR((Таблица69171116[Profit]/Таблица69171116[Buy-in])*100,0)","v":0},{"$f":"IFERROR((COUNTIFS(Таблица1[No],Таблица69171116[2019],Таблица1[Winnings],\">0\")/Таблица69171116[Games])*100,0)","v":0},{"$f":"SUMIFS(Таблица1[Total Hands],Таблица1[No],Таблица69171116[[#This Row],[2019]])","v":0},{"$f":"IFERROR(SUMIFS(Таблица1[bb/101],Таблица1[No],Таблица69171116[[#This Row],[2019]])/Таблица69171116[[#This Row],[Hand]],0)","v":0},{"$f":"IFERROR(SUMIFS(Таблица1[EV bb/101],Таблица1[No],Таблица69171116[[#This Row],[2019]])/Таблица69171116[[#This Row],[Hand]],0)","v":0},{"$f":"SUMIFS(Таблица1[Net Winnings],Таблица1[No],Таблица69171116[2019])","v":0},{"$f":"IFERROR(Таблица69171116[[#This Row],[Profit]]/Таблица69171116[[#This Row],[Games]],0)","v":0}]
[null,null,null,37,{"$f":"COUNTIFS(Таблица1[No],Таблица69171116[[#This Row],[2019]])+SUMIFS(Таблица1[Re-entry],Таблица1[No],Таблица69171116[[#This Row],[2019]])","v":0},{"$f":"SUMIFS(Таблица1[Total Buy-In],Таблица1[No],Таблица69171116[[#This Row],[2019]])","v":0},{"$f":"IFERROR(Таблица69171116[Buy-in]/Таблица69171116[Games],0)","v":0},{"$f":"IFERROR((Таблица69171116[Profit]/Таблица69171116[Buy-in])*100,0)","v":0},{"$f":"IFERROR((COUNTIFS(Таблица1[No],Таблица69171116[2019],Таблица1[Winnings],\">0\")/Таблица69171116[Games])*100,0)","v":0},{"$f":"SUMIFS(Таблица1[Total Hands],Таблица1[No],Таблица69171116[[#This Row],[2019]])","v":0},{"$f":"IFERROR(SUMIFS(Таблица1[bb/101],Таблица1[No],Таблица69171116[[#This Row],[2019]])/Таблица69171116[[#This Row],[Hand]],0)","v":0},{"$f":"IFERROR(SUMIFS(Таблица1[EV bb/101],Таблица1[No],Таблица69171116[[#This Row],[2019]])/Таблица69171116[[#This Row],[Hand]],0)","v":0},{"$f":"SUMIFS(Таблица1[Net Winnings],Таблица1[No],Таблица69171116[2019])","v":0},{"$f":"IFERROR(Таблица69171116[[#This Row],[Profit]]/Таблица69171116[[#This Row],[Games]],0)","v":0}]
[null,null,null,38,{"$f":"COUNTIFS(Таблица1[No],Таблица69171116[[#This Row],[2019]])+SUMIFS(Таблица1[Re-entry],Таблица1[No],Таблица69171116[[#This Row],[2019]])","v":0},{"$f":"SUMIFS(Таблица1[Total Buy-In],Таблица1[No],Таблица69171116[[#This Row],[2019]])","v":0},{"$f":"IFERROR(Таблица69171116[Buy-in]/Таблица69171116[Games],0)","v":0},{"$f":"IFERROR((Таблица69171116[Profit]/Таблица69171116[Buy-in])*100,0)","v":0},{"$f":"IFERROR((COUNTIFS(Таблица1[No],Таблица69171116[2019],Таблица1[Winnings],\">0\")/Таблица69171116[Games])*100,0)","v":0},{"$f":"SUMIFS(Таблица1[Total Hands],Таблица1[No],Таблица69171116[[#This Row],[2019]])","v":0},{"$f":"IFERROR(SUMIFS(Таблица1[bb/101],Таблица1[No],Таблица69171116[[#This Row],[2019]])/Таблица69171116[[#This Row],[Hand]],0)","v":0},{"$f":"IFERROR(SUMIFS(Таблица1[EV bb/101],Таблица1[No],Таблица69171116[[#This Row],[2019]])/Таблица69171116[[#This Row],[Hand]],0)","v":0},{"$f":"SUMIFS(Таблица1[Net Winnings],Таблица1[No],Таблица69171116[2019])","v":0},{"$f":"IFERROR(Таблица69171116[[#This Row],[Profit]]/Таблица69171116[[#This Row],[Games]],0)","v":0}]
[null,null,null,39,{"$f":"COUNTIFS(Таблица1[No],Таблица69171116[[#This Row],[2019]])+SUMIFS(Таблица1[Re-entry],Таблица1[No],Таблица69171116[[#This Row],[2019]])","v":0},{"$f":"SUMIFS(Таблица1[Total Buy-In],Таблица1[No],Таблица69171116[[#This Row],[2019]])","v":0},{"$f":"IFERROR(Таблица69171116[Buy-in]/Таблица69171116[Games],0)","v":0},{"$f":"IFERROR((Таблица69171116[Profit]/Таблица69171116[Buy-in])*100,0)","v":0},{"$f":"IFERROR((COUNTIFS(Таблица1[No],Таблица69171116[2019],Таблица1[Winnings],\">0\")/Таблица69171116[Games])*100,0)","v":0},{"$f":"SUMIFS(Таблица1[Total Hands],Таблица1[No],Таблица69171116[[#This Row],[2019]])","v":0},{"$f":"IFERROR(SUMIFS(Таблица1[bb/101],Таблица1[No],Таблица69171116[[#This Row],[2019]])/Таблица69171116[[#This Row],[Hand]],0)","v":0},{"$f":"IFERROR(SUMIFS(Таблица1[EV bb/101],Таблица1[No],Таблица69171116[[#This Row],[2019]])/Таблица69171116[[#This Row],[Hand]],0)","v":0},{"$f":"SUMIFS(Таблица1[Net Winnings],Таблица1[No],Таблица69171116[2019])","v":0},{"$f":"IFERROR(Таблица69171116[[#This Row],[Profit]]/Таблица69171116[[#This Row],[Games]],0)","v":0}]
[null,null,null,40,{"$f":"COUNTIFS(Таблица1[No],Таблица69171116[[#This Row],[2019]])+SUMIFS(Таблица1[Re-entry],Таблица1[No],Таблица69171116[[#This Row],[2019]])","v":0},{"$f":"SUMIFS(Таблица1[Total Buy-In],Таблица1[No],Таблица69171116[[#This Row],[2019]])","v":0},{"$f":"IFERROR(Таблица69171116[Buy-in]/Таблица69171116[Games],0)","v":0},{"$f":"IFERROR((Таблица69171116[Profit]/Таблица69171116[Buy-in])*100,0)","v":0},{"$f":"IFERROR((COUNTIFS(Таблица1[No],Таблица69171116[2019],Таблица1[Winnings],\">0\")/Таблица69171116[Games])*100,0)","v":0},{"$f":"SUMIFS(Таблица1[Total Hands],Таблица1[No],Таблица69171116[[#This Row],[2019]])","v":0},{"$f":"IFERROR(SUMIFS(Таблица1[bb/101],Таблица1[No],Таблица69171116[[#This Row],[2019]])/Таблица69171116[[#This Row],[Hand]],0)","v":0},{"$f":"IFERROR(SUMIFS(Таблица1[EV bb/101],Таблица1[No],Таблица69171116[[#This Row],[2019]])/Таблица69171116[[#This Row],[Hand]],0)","v":0},{"$f":"SUMIFS(Таблица1[Net Winnings],Таблица1[No],Таблица69171116[2019])","v":0},{"$f":"IFERROR(Таблица69171116[[#This Row],[Profit]]/Таблица69171116[[#This Row],[Games]],0)","v":0}]
[null,null,null,41,{"$f":"COUNTIFS(Таблица1[No],Таблица69171116[[#This Row],[2019]])+SUMIFS(Таблица1[Re-entry],Таблица1[No],Таблица69171116[[#This Row],[2019]])","v":0},{"$f":"SUMIFS(Таблица1[Total Buy-In],Таблица1[No],Таблица69171116[[#This Row],[2019]])","v":0},{"$f":"IFERROR(Таблица69171116[Buy-in]/Таблица69171116[Games],0)","v":0},{"$f":"IFERROR((Таблица69171116[Profit]/Таблица69171116[Buy-in])*100,0)","v":0},{"$f":"IFERROR((COUNTIFS(Таблица1[No],Таблица69171116[2019],Таблица1[Winnings],\">0\")/Таблица69171116[Games])*100,0)","v":0},{"$f":"SUMIFS(Таблица1[Total Hands],Таблица1[No],Таблица69171116[[#This Row],[2019]])","v":0},{"$f":"IFERROR(SUMIFS(Таблица1[bb/101],Таблица1[No],Таблица69171116[[#This Row],[2019]])/Таблица69171116[[#This Row],[Hand]],0)","v":0},{"$f":"IFERROR(SUMIFS(Таблица1[EV bb/101],Таблица1[No],Таблица69171116[[#This Row],[2019]])/Таблица69171116[[#This Row],[Hand]],0)","v":0},{"$f":"SUMIFS(Таблица1[Net Winnings],Таблица1[No],Таблица69171116[2019])","v":0},{"$f":"IFERROR(Таблица69171116[[#This Row],[Profit]]/Таблица69171116[[#This Row],[Games]],0)","v":0}]
[null,null,null,42,{"$f":"COUNTIFS(Таблица1[No],Таблица69171116[[#This Row],[2019]])+SUMIFS(Таблица1[Re-entry],Таблица1[No],Таблица69171116[[#This Row],[2019]])","v":0},{"$f":"SUMIFS(Таблица1[Total Buy-In],Таблица1[No],Таблица69171116[[#This Row],[2019]])","v":0},{"$f":"IFERROR(Таблица69171116[Buy-in]/Таблица69171116[Games],0)","v":0},{"$f":"IFERROR((Таблица69171116[Profit]/Таблица69171116[Buy-in])*100,0)","v":0},{"$f":"IFERROR((COUNTIFS(Таблица1[No],Таблица69171116[2019],Таблица1[Winnings],\">0\")/Таблица69171116[Games])*100,0)","v":0},{"$f":"SUMIFS(Таблица1[Total Hands],Таблица1[No],Таблица69171116[[#This Row],[2019]])","v":0},{"$f":"IFERROR(SUMIFS(Таблица1[bb/101],Таблица1[No],Таблица69171116[[#This Row],[2019]])/Таблица69171116[[#This Row],[Hand]],0)","v":0},{"$f":"IFERROR(SUMIFS(Таблица1[EV bb/101],Таблица1[No],Таблица69171116[[#This Row],[2019]])/Таблица69171116[[#This Row],[Hand]],0)","v":0},{"$f":"SUMIFS(Таблица1[Net Winnings],Таблица1[No],Таблица69171116[2019])","v":0},{"$f":"IFERROR(Таблица69171116[[#This Row],[Profit]]/Таблица69171116[[#This Row],[Games]],0)","v":0}]
[null,null,null,43,{"$f":"COUNTIFS(Таблица1[No],Таблица69171116[[#This Row],[2019]])+SUMIFS(Таблица1[Re-entry],Таблица1[No],Таблица69171116[[#This Row],[2019]])","v":0},{"$f":"SUMIFS(Таблица1[Total Buy-In],Таблица1[No],Таблица69171116[[#This Row],[2019]])","v":0},{"$f":"IFERROR(Таблица69171116[Buy-in]/Таблица69171116[Games],0)","v":0},{"$f":"IFERROR((Таблица69171116[Profit]/Таблица69171116[Buy-in])*100,0)","v":0},{"$f":"IFERROR((COUNTIFS(Таблица1[No],Таблица69171116[2019],Таблица1[Winnings],\">0\")/Таблица69171116[Games])*100,0)","v":0},{"$f":"SUMIFS(Таблица1[Total Hands],Таблица1[No],Таблица69171116[[#This Row],[2019]])","v":0},{"$f":"IFERROR(SUMIFS(Таблица1[bb/101],Таблица1[No],Таблица69171116[[#This Row],[2019]])/Таблица69171116[[#This Row],[Hand]],0)","v":0},{"$f":"IFERROR(SUMIFS(Таблица1[EV bb/101],Таблица1[No],Таблица69171116[[#This Row],[2019]])/Таблица69171116[[#This Row],[Hand]],0)","v":0},{"$f":"SUMIFS(Таблица1[Net Winnings],Таблица1[No],Таблица69171116[2019])","v":0},{"$f":"IFERROR(Таблица69171116[[#This Row],[Profit]]/Таблица69171116[[#This Row],[Games]],0)","v":0}]
[null,null,null,44,{"$f":"COUNTIFS(Таблица1[No],Таблица69171116[[#This Row],[2019]])+SUMIFS(Таблица1[Re-entry],Таблица1[No],Таблица69171116[[#This Row],[2019]])","v":0},{"$f":"SUMIFS(Таблица1[Total Buy-In],Таблица1[No],Таблица69171116[[#This Row],[2019]])","v":0},{"$f":"IFERROR(Таблица69171116[Buy-in]/Таблица69171116[Games],0)","v":0},{"$f":"IFERROR((Таблица69171116[Profit]/Таблица69171116[Buy-in])*100,0)","v":0},{"$f":"IFERROR((COUNTIFS(Таблица1[No],Таблица69171116[2019],Таблица1[Winnings],\">0\")/Таблица69171116[Games])*100,0)","v":0},{"$f":"SUMIFS(Таблица1[Total Hands],Таблица1[No],Таблица69171116[[#This Row],[2019]])","v":0},{"$f":"IFERROR(SUMIFS(Таблица1[bb/101],Таблица1[No],Таблица69171116[[#This Row],[2019]])/Таблица69171116[[#This Row],[Hand]],0)","v":0},{"$f":"IFERROR(SUMIFS(Таблица1[EV bb/101],Таблица1[No],Таблица69171116[[#This Row],[2019]])/Таблица69171116[[#This Row],[Hand]],0)","v":0},{"$f":"SUMIFS(Таблица1[Net Winnings],Таблица1[No],Таблица69171116[2019])","v":0},{"$f":"IFERROR(Таблица69171116[[#This Row],[Profit]]/Таблица69171116[[#This Row],[Games]],0)","v":0}]
[null,null,null,45,{"$f":"COUNTIFS(Таблица1[No],Таблица69171116[[#This Row],[2019]])+SUMIFS(Таблица1[Re-entry],Таблица1[No],Таблица69171116[[#This Row],[2019]])","v":0},{"$f":"SUMIFS(Таблица1[Total Buy-In],Таблица1[No],Таблица69171116[[#This Row],[2019]])","v":0},{"$f":"IFERROR(Таблица69171116[Buy-in]/Таблица69171116[Games],0)","v":0},{"$f":"IFERROR((Таблица69171116[Profit]/Таблица69171116[Buy-in])*100,0)","v":0},{"$f":"IFERROR((COUNTIFS(Таблица1[No],Таблица69171116[2019],Таблица1[Winnings],\">0\")/Таблица69171116[Games])*100,0)","v":0},{"$f":"SUMIFS(Таблица1[Total Hands],Таблица1[No],Таблица69171116[[#This Row],[2019]])","v":0},{"$f":"IFERROR(SUMIFS(Таблица1[bb/101],Таблица1[No],Таблица69171116[[#This Row],[2019]])/Таблица69171116[[#This Row],[Hand]],0)","v":0},{"$f":"IFERROR(SUMIFS(Таблица1[EV bb/101],Таблица1[No],Таблица69171116[[#This Row],[2019]])/Таблица69171116[[#This Row],[Hand]],0)","v":0},{"$f":"SUMIFS(Таблица1[Net Winnings],Таблица1[No],Таблица69171116[2019])","v":0},{"$f":"IFERROR(Таблица69171116[[#This Row],[Profit]]/Таблица69171116[[#This Row],[Games]],0)","v":0}]
[null,null,null,46,{"$f":"COUNTIFS(Таблица1[No],Таблица69171116[[#This Row],[2019]])+SUMIFS(Таблица1[Re-entry],Таблица1[No],Таблица69171116[[#This Row],[2019]])","v":0},{"$f":"SUMIFS(Таблица1[Total Buy-In],Таблица1[No],Таблица69171116[[#This Row],[2019]])","v":0},{"$f":"IFERROR(Таблица69171116[Buy-in]/Таблица69171116[Games],0)","v":0},{"$f":"IFERROR((Таблица69171116[Profit]/Таблица69171116[Buy-in])*100,0)","v":0},{"$f":"IFERROR((COUNTIFS(Таблица1[No],Таблица69171116[2019],Таблица1[Winnings],\">0\")/Таблица69171116[Games])*100,0)","v":0},{"$f":"SUMIFS(Таблица1[Total Hands],Таблица1[No],Таблица69171116[[#This Row],[2019]])","v":0},{"$f":"IFERROR(SUMIFS(Таблица1[bb/101],Таблица1[No],Таблица69171116[[#This Row],[2019]])/Таблица69171116[[#This Row],[Hand]],0)","v":0},{"$f":"IFERROR(SUMIFS(Таблица1[EV bb/101],Таблица1[No],Таблица69171116[[#This Row],[2019]])/Таблица69171116[[#This Row],[Hand]],0)","v":0},{"$f":"SUMIFS(Таблица1[Net Winnings],Таблица1[No],Таблица69171116[2019])","v":0},{"$f":"IFERROR(Таблица69171116[[#This Row],[Profit]]/Таблица69171116[[#This Row],[Games]],0)","v":0}]
[null,null,null,47,{"$f":"COUNTIFS(Таблица1[No],Таблица69171116[[#This Row],[2019]])+SUMIFS(Таблица1[Re-entry],Таблица1[No],Таблица69171116[[#This Row],[2019]])","v":0},{"$f":"SUMIFS(Таблица1[Total Buy-In],Таблица1[No],Таблица69171116[[#This Row],[2019]])","v":0},{"$f":"IFERROR(Таблица69171116[Buy-in]/Таблица69171116[Games],0)","v":0},{"$f":"IFERROR((Таблица69171116[Profit]/Таблица69171116[Buy-in])*100,0)","v":0},{"$f":"IFERROR((COUNTIFS(Таблица1[No],Таблица69171116[2019],Таблица1[Winnings],\">0\")/Таблица69171116[Games])*100,0)","v":0},{"$f":"SUMIFS(Таблица1[Total Hands],Таблица1[No],Таблица69171116[[#This Row],[2019]])","v":0},{"$f":"IFERROR(SUMIFS(Таблица1[bb/101],Таблица1[No],Таблица69171116[[#This Row],[2019]])/Таблица69171116[[#This Row],[Hand]],0)","v":0},{"$f":"IFERROR(SUMIFS(Таблица1[EV bb/101],Таблица1[No],Таблица69171116[[#This Row],[2019]])/Таблица69171116[[#This Row],[Hand]],0)","v":0},{"$f":"SUMIFS(Таблица1[Net Winnings],Таблица1[No],Таблица69171116[2019])","v":0},{"$f":"IFERROR(Таблица69171116[[#This Row],[Profit]]/Таблица69171116[[#This Row],[Games]],0)","v":0}]
[null,null,null,48,{"$f":"COUNTIFS(Таблица1[No],Таблица69171116[[#This Row],[2019]])+SUMIFS(Таблица1[Re-entry],Таблица1[No],Таблица69171116[[#This Row],[2019]])","v":0},{"$f":"SUMIFS(Таблица1[Total Buy-In],Таблица1[No],Таблица69171116[[#This Row],[2019]])","v":0},{"$f":"IFERROR(Таблица69171116[Buy-in]/Таблица69171116[Games],0)","v":0},{"$f":"IFERROR((Таблица69171116[Profit]/Таблица69171116[Buy-in])*100,0)","v":0},{"$f":"IFERROR((COUNTIFS(Таблица1[No],Таблица69171116[2019],Таблица1[Winnings],\">0\")/Таблица69171116[Games])*100,0)","v":0},{"$f":"SUMIFS(Таблица1[Total Hands],Таблица1[No],Таблица69171116[[#This Row],[2019]])","v":0},{"$f":"IFERROR(SUMIFS(Таблица1[bb/101],Таблица1[No],Таблица69171116[[#This Row],[2019]])/Таблица69171116[[#This Row],[Hand]],0)","v":0},{"$f":"IFERROR(SUMIFS(Таблица1[EV bb/101],Таблица1[No],Таблица69171116[[#This Row],[2019]])/Таблица69171116[[#This Row],[Hand]],0)","v":0},{"$f":"SUMIFS(Таблица1[Net Winnings],Таблица1[No],Таблица69171116[2019])","v":0},{"$f":"IFERROR(Таблица69171116[[#This Row],[Profit]]/Таблица69171116[[#This Row],[Games]],0)","v":0}]
[null,null,null,49,{"$f":"COUNTIFS(Таблица1[No],Таблица69171116[[#This Row],[2019]])+SUMIFS(Таблица1[Re-entry],Таблица1[No],Таблица69171116[[#This Row],[2019]])","v":0},{"$f":"SUMIFS(Таблица1[Total Buy-In],Таблица1[No],Таблица69171116[[#This Row],[2019]])","v":0},{"$f":"IFERROR(Таблица69171116[Buy-in]/Таблица69171116[Games],0)","v":0},{"$f":"IFERROR((Таблица69171116[Profit]/Таблица69171116[Buy-in])*100,0)","v":0},{"$f":"IFERROR((COUNTIFS(Таблица1[No],Таблица69171116[2019],Таблица1[Winnings],\">0\")/Таблица69171116[Games])*100,0)","v":0},{"$f":"SUMIFS(Таблица1[Total Hands],Таблица1[No],Таблица69171116[[#This Row],[2019]])","v":0},{"$f":"IFERROR(SUMIFS(Таблица1[bb/101],Таблица1[No],Таблица69171116[[#This Row],[2019]])/Таблица69171116[[#This Row],[Hand]],0)","v":0},{"$f":"IFERROR(SUMIFS(Таблица1[EV bb/101],Таблица1[No],Таблица69171116[[#This Row],[2019]])/Таблица69171116[[#This Row],[Hand]],0)","v":0},{"$f":"SUMIFS(Таблица1[Net Winnings],Таблица1[No],Таблица69171116[2019])","v":0},{"$f":"IFERROR(Таблица69171116[[#This Row],[Profit]]/Таблица69171116[[#This Row],[Games]],0)","v":0}]
[null,null,null,50,{"$f":"COUNTIFS(Таблица1[No],Таблица69171116[[#This Row],[2019]])+SUMIFS(Таблица1[Re-entry],Таблица1[No],Таблица69171116[[#This Row],[2019]])","v":0},{"$f":"SUMIFS(Таблица1[Total Buy-In],Таблица1[No],Таблица69171116[[#This Row],[2019]])","v":0},{"$f":"IFERROR(Таблица69171116[Buy-in]/Таблица69171116[Games],0)","v":0},{"$f":"IFERROR((Таблица69171116[Profit]/Таблица69171116[Buy-in])*100,0)","v":0},{"$f":"IFERROR((COUNTIFS(Таблица1[No],Таблица69171116[2019],Таблица1[Winnings],\">0\")/Таблица69171116[Games])*100,0)","v":0},{"$f":"SUMIFS(Таблица1[Total Hands],Таблица1[No],Таблица69171116[[#This Row],[2019]])","v":0},{"$f":"IFERROR(SUMIFS(Таблица1[bb/101],Таблица1[No],Таблица69171116[[#This Row],[2019]])/Таблица69171116[[#This Row],[Hand]],0)","v":0},{"$f":"IFERROR(SUMIFS(Таблица1[EV bb/101],Таблица1[No],Таблица69171116[[#This Row],[2019]])/Таблица69171116[[#This Row],[Hand]],0)","v":0},{"$f":"SUMIFS(Таблица1[Net Winnings],Таблица1[No],Таблица69171116[2019])","v":0},{"$f":"IFERROR(Таблица69171116[[#This Row],[Profit]]/Таблица69171116[[#This Row],[Games]],0)","v":0}]
[null,null,null,51,{"$f":"COUNTIFS(Таблица1[No],Таблица69171116[[#This Row],[2019]])+SUMIFS(Таблица1[Re-entry],Таблица1[No],Таблица69171116[[#This Row],[2019]])","v":0},{"$f":"SUMIFS(Таблица1[Total Buy-In],Таблица1[No],Таблица69171116[[#This Row],[2019]])","v":0},{"$f":"IFERROR(Таблица69171116[Buy-in]/Таблица69171116[Games],0)","v":0},{"$f":"IFERROR((Таблица69171116[Profit]/Таблица69171116[Buy-in])*100,0)","v":0},{"$f":"IFERROR((COUNTIFS(Таблица1[No],Таблица69171116[2019],Таблица1[Winnings],\">0\")/Таблица69171116[Games])*100,0)","v":0},{"$f":"SUMIFS(Таблица1[Total Hands],Таблица1[No],Таблица69171116[[#This Row],[2019]])","v":0},{"$f":"IFERROR(SUMIFS(Таблица1[bb/101],Таблица1[No],Таблица69171116[[#This Row],[2019]])/Таблица69171116[[#This Row],[Hand]],0)","v":0},{"$f":"IFERROR(SUMIFS(Таблица1[EV bb/101],Таблица1[No],Таблица69171116[[#This Row],[2019]])/Таблица69171116[[#This Row],[Hand]],0)","v":0},{"$f":"SUMIFS(Таблица1[Net Winnings],Таблица1[No],Таблица69171116[2019])","v":0},{"$f":"IFERROR(Таблица69171116[[#This Row],[Profit]]/Таблица69171116[[#This Row],[Games]],0)","v":0}]
[null,null,null,52,{"$f":"COUNTIFS(Таблица1[No],Таблица69171116[[#This Row],[2019]])+SUMIFS(Таблица1[Re-entry],Таблица1[No],Таблица69171116[[#This Row],[2019]])","v":0},{"$f":"SUMIFS(Таблица1[Total Buy-In],Таблица1[No],Таблица69171116[[#This Row],[2019]])","v":0},{"$f":"IFERROR(Таблица69171116[Buy-in]/Таблица69171116[Games],0)","v":0},{"$f":"IFERROR((Таблица69171116[Profit]/Таблица69171116[Buy-in])*100,0)","v":0},{"$f":"IFERROR((COUNTIFS(Таблица1[No],Таблица69171116[2019],Таблица1[Winnings],\">0\")/Таблица69171116[Games])*100,0)","v":0},{"$f":"SUMIFS(Таблица1[Total Hands],Таблица1[No],Таблица69171116[[#This Row],[2019]])","v":0},{"$f":"IFERROR(SUMIFS(Таблица1[bb/101],Таблица1[No],Таблица69171116[[#This Row],[2019]])/Таблица69171116[[#This Row],[Hand]],0)","v":0},{"$f":"IFERROR(SUMIFS(Таблица1[EV bb/101],Таблица1[No],Таблица69171116[[#This Row],[2019]])/Таблица69171116[[#This Row],[Hand]],0)","v":0},{"$f":"SUMIFS(Таблица1[Net Winnings],Таблица1[No],Таблица69171116[2019])","v":0},{"$f":"IFERROR(Таблица69171116[[#This Row],[Profit]]/Таблица69171116[[#This Row],[Games]],0)","v":0}]
[null,null,null,53,{"$f":"COUNTIFS(Таблица1[No],Таблица69171116[[#This Row],[2019]])+SUMIFS(Таблица1[Re-entry],Таблица1[No],Таблица69171116[[#This Row],[2019]])","v":0},{"$f":"SUMIFS(Таблица1[Total Buy-In],Таблица1[No],Таблица69171116[[#This Row],[2019]])","v":0},{"$f":"IFERROR(Таблица69171116[Buy-in]/Таблица69171116[Games],0)","v":0},{"$f":"IFERROR((Таблица69171116[Profit]/Таблица69171116[Buy-in])*100,0)","v":0},{"$f":"IFERROR((COUNTIFS(Таблица1[No],Таблица69171116[2019],Таблица1[Winnings],\">0\")/Таблица69171116[Games])*100,0)","v":0},{"$f":"SUMIFS(Таблица1[Total Hands],Таблица1[No],Таблица69171116[[#This Row],[2019]])","v":0},{"$f":"IFERROR(SUMIFS(Таблица1[bb/101],Таблица1[No],Таблица69171116[[#This Row],[2019]])/Таблица69171116[[#This Row],[Hand]],0)","v":0},{"$f":"IFERROR(SUMIFS(Таблица1[EV bb/101],Таблица1[No],Таблица69171116[[#This Row],[2019]])/Таблица69171116[[#This Row],[Hand]],0)","v":0},{"$f":"SUMIFS(Таблица1[Net Winnings],Таблица1[No],Таблица69171116[2019])","v":0},{"$f":"IFERROR(Таблица69171116[[#This Row],[Profit]]/Таблица69171116[[#This Row],[Games]],0)","v":0}]

{"sheet":"деньнед","index":6,"n_rows":10,"n_cols":12,"rows_kept":10,"cut":false,"hidden":false,"merged":[]}
[]
[]
[null,"2019","Games","Buy-in","ABI","Roi","Itm","Hand","bb/100","EV bb/100","Profit","Pr/Game"]
[null,"понедельник",{"$f":"COUNTIFS(Таблица1[deni nedeli],Таблица6917[[#This Row],[2019]])+SUMIFS(Таблица1[Re-entry],Таблица1[deni nedeli],Таблица6917[[#This Row],[2019]])","v":4},{"$f":"SUMIFS(Таблица1[Total Buy-In],Таблица1[deni nedeli],Таблица6917[[#This Row],[2019]])","v":1},{"$f":"IFERROR(Таблица6917[Buy-in]/Таблица6917[Games],0)","v":0.25},{"$f":"IFERROR((Таблица6917[Profit]/Таблица6917[Buy-in])*100,0)","v":223},{"$f":"IFERROR((COUNTIFS(Таблица1[deni nedeli],Таблица6917[2019],Таблица1[Winnings],\">0\")/Таблица6917[Games])*100,0)","v":25},{"$f":"SUMIFS(Таблица1[Total Hands],Таблица1[deni nedeli],Таблица6917[[#This Row],[2019]])","v":416},{"$f":"IFERROR(SUMIFS(Таблица1[bb/101],Таблица1[deni nedeli],Таблица6917[[#This Row],[2019]])/Таблица6917[[#This Row],[Hand]],0)","v":18.658221153846153},{"$f":"IFERROR(SUMIFS(Таблица1[EV bb/101],Таблица1[deni nedeli],Таблица6917[[#This Row],[2019]])/Таблица6917[[#This Row],[Hand]],0)","v":5.9914182692307678},{"$f":"SUMIFS(Таблица1[Net Winnings],Таблица1[deni nedeli],Таблица6917[2019])","v":2.23},{"$f":"IFERROR(Таблица6917[[#This Row],[Profit]]/Таблица6917[[#This Row],[Games]],0)","v":0.5575}]
[null,"вторник",{"$f":"COUNTIFS(Таблица1[deni nedeli],Таблица6917[[#This Row],[2019]])+SUMIFS(Таблица1[Re-entry],Таблица1[deni nedeli],Таблица6917[[#This Row],[2019]])","v":0},{"$f":"SUMIFS(Таблица1[Total Buy-In],Таблица1[deni nedeli],Таблица6917[[#This Row],[2019]])","v":0},{"$f":"IFERROR(Таблица6917[Buy-in]/Таблица6917[Games],0)","v":0},{"$f":"IFERROR((Таблица6917[Profit]/Таблица6917[Buy-in])*100,0)","v":0},{"$f":"IFERROR((COUNTIFS(Таблица1[deni nedeli],Таблица6917[2019],Таблица1[Winnings],\">0\")/Таблица6917[Games])*100,0)","v":0},{"$f":"SUMIFS(Таблица1[Total Hands],Таблица1[deni nedeli],Таблица6917[[#This Row],[2019]])","v":0},{"$f":"IFERROR(SUMIFS(Таблица1[bb/101],Таблица1[deni nedeli],Таблица6917[[#This Row],[2019]])/Таблица6917[[#This Row],[Hand]],0)","v":0},{"$f":"IFERROR(SUMIFS(Таблица1[EV bb/101],Таблица1[deni nedeli],Таблица6917[[#This Row],[2019]])/Таблица6917[[#This Row],[Hand]],0)","v":0},{"$f":"SUMIFS(Таблица1[Net Winnings],Таблица1[deni nedeli],Таблица6917[2019])","v":0},{"$f":"IFERROR(Таблица6917[[#This Row],[Profit]]/Таблица6917[[#This Row],[Games]],0)","v":0}]
[null,"среда",{"$f":"COUNTIFS(Таблица1[deni nedeli],Таблица6917[[#This Row],[2019]])+SUMIFS(Таблица1[Re-entry],Таблица1[deni nedeli],Таблица6917[[#This Row],[2019]])","v":0},{"$f":"SUMIFS(Таблица1[Total Buy-In],Таблица1[deni nedeli],Таблица6917[[#This Row],[2019]])","v":0},{"$f":"IFERROR(Таблица6917[Buy-in]/Таблица6917[Games],0)","v":0},{"$f":"IFERROR((Таблица6917[Profit]/Таблица6917[Buy-in])*100,0)","v":0},{"$f":"IFERROR((COUNTIFS(Таблица1[deni nedeli],Таблица6917[2019],Таблица1[Winnings],\">0\")/Таблица6917[Games])*100,0)","v":0},{"$f":"SUMIFS(Таблица1[Total Hands],Таблица1[deni nedeli],Таблица6917[[#This Row],[2019]])","v":0},{"$f":"IFERROR(SUMIFS(Таблица1[bb/101],Таблица1[deni nedeli],Таблица6917[[#This Row],[2019]])/Таблица6917[[#This Row],[Hand]],0)","v":0},{"$f":"IFERROR(SUMIFS(Таблица1[EV bb/101],Таблица1[deni nedeli],Таблица6917[[#This Row],[2019]])/Таблица6917[[#This Row],[Hand]],0)","v":0},{"$f":"SUMIFS(Таблица1[Net Winnings],Таблица1[deni nedeli],Таблица6917[2019])","v":0},{"$f":"IFERROR(Таблица6917[[#This Row],[Profit]]/Таблица6917[[#This Row],[Games]],0)","v":0}]
[null,"четверг",{"$f":"COUNTIFS(Таблица1[deni nedeli],Таблица6917[[#This Row],[2019]])+SUMIFS(Таблица1[Re-entry],Таблица1[deni nedeli],Таблица6917[[#This Row],[2019]])","v":0},{"$f":"SUMIFS(Таблица1[Total Buy-In],Таблица1[deni nedeli],Таблица6917[[#This Row],[2019]])","v":0},{"$f":"IFERROR(Таблица6917[Buy-in]/Таблица6917[Games],0)","v":0},{"$f":"IFERROR((Таблица6917[Profit]/Таблица6917[Buy-in])*100,0)","v":0},{"$f":"IFERROR((COUNTIFS(Таблица1[deni nedeli],Таблица6917[2019],Таблица1[Winnings],\">0\")/Таблица6917[Games])*100,0)","v":0},{"$f":"SUMIFS(Таблица1[Total Hands],Таблица1[deni nedeli],Таблица6917[[#This Row],[2019]])","v":0},{"$f":"IFERROR(SUMIFS(Таблица1[bb/101],Таблица1[deni nedeli],Таблица6917[[#This Row],[2019]])/Таблица6917[[#This Row],[Hand]],0)","v":0},{"$f":"IFERROR(SUMIFS(Таблица1[EV bb/101],Таблица1[deni nedeli],Таблица6917[[#This Row],[2019]])/Таблица6917[[#This Row],[Hand]],0)","v":0},{"$f":"SUMIFS(Таблица1[Net Winnings],Таблица1[deni nedeli],Таблица6917[2019])","v":0},{"$f":"IFERROR(Таблица6917[[#This Row],[Profit]]/Таблица6917[[#This Row],[Games]],0)","v":0}]
[null,"пятница",{"$f":"COUNTIFS(Таблица1[deni nedeli],Таблица6917[[#This Row],[2019]])+SUMIFS(Таблица1[Re-entry],Таблица1[deni nedeli],Таблица6917[[#This Row],[2019]])","v":0},{"$f":"SUMIFS(Таблица1[Total Buy-In],Таблица1[deni nedeli],Таблица6917[[#This Row],[2019]])","v":0},{"$f":"IFERROR(Таблица6917[Buy-in]/Таблица6917[Games],0)","v":0},{"$f":"IFERROR((Таблица6917[Profit]/Таблица6917[Buy-in])*100,0)","v":0},{"$f":"IFERROR((COUNTIFS(Таблица1[deni nedeli],Таблица6917[2019],Таблица1[Winnings],\">0\")/Таблица6917[Games])*100,0)","v":0},{"$f":"SUMIFS(Таблица1[Total Hands],Таблица1[deni nedeli],Таблица6917[[#This Row],[2019]])","v":0},{"$f":"IFERROR(SUMIFS(Таблица1[bb/101],Таблица1[deni nedeli],Таблица6917[[#This Row],[2019]])/Таблица6917[[#This Row],[Hand]],0)","v":0},{"$f":"IFERROR(SUMIFS(Таблица1[EV bb/101],Таблица1[deni nedeli],Таблица6917[[#This Row],[2019]])/Таблица6917[[#This Row],[Hand]],0)","v":0},{"$f":"SUMIFS(Таблица1[Net Winnings],Таблица1[deni nedeli],Таблица6917[2019])","v":0},{"$f":"IFERROR(Таблица6917[[#This Row],[Profit]]/Таблица6917[[#This Row],[Games]],0)","v":0}]
[null,"суббота",{"$f":"COUNTIFS(Таблица1[deni nedeli],Таблица6917[[#This Row],[2019]])+SUMIFS(Таблица1[Re-entry],Таблица1[deni nedeli],Таблица6917[[#This Row],[2019]])","v":0},{"$f":"SUMIFS(Таблица1[Total Buy-In],Таблица1[deni nedeli],Таблица6917[[#This Row],[2019]])","v":0},{"$f":"IFERROR(Таблица6917[Buy-in]/Таблица6917[Games],0)","v":0},{"$f":"IFERROR((Таблица6917[Profit]/Таблица6917[Buy-in])*100,0)","v":0},{"$f":"IFERROR((COUNTIFS(Таблица1[deni nedeli],Таблица6917[2019],Таблица1[Winnings],\">0\")/Таблица6917[Games])*100,0)","v":0},{"$f":"SUMIFS(Таблица1[Total Hands],Таблица1[deni nedeli],Таблица6917[[#This Row],[2019]])","v":0},{"$f":"IFERROR(SUMIFS(Таблица1[bb/101],Таблица1[deni nedeli],Таблица6917[[#This Row],[2019]])/Таблица6917[[#This Row],[Hand]],0)","v":0},{"$f":"IFERROR(SUMIFS(Таблица1[EV bb/101],Таблица1[deni nedeli],Таблица6917[[#This Row],[2019]])/Таблица6917[[#This Row],[Hand]],0)","v":0},{"$f":"SUMIFS(Таблица1[Net Winnings],Таблица1[deni nedeli],Таблица6917[2019])","v":0},{"$f":"IFERROR(Таблица6917[[#This Row],[Profit]]/Таблица6917[[#This Row],[Games]],0)","v":0}]
[null,"воскресенье",{"$f":"COUNTIFS(Таблица1[deni nedeli],Таблица6917[[#This Row],[2019]])+SUMIFS(Таблица1[Re-entry],Таблица1[deni nedeli],Таблица6917[[#This Row],[2019]])","v":0},{"$f":"SUMIFS(Таблица1[Total Buy-In],Таблица1[deni nedeli],Таблица6917[[#This Row],[2019]])","v":0},{"$f":"IFERROR(Таблица6917[Buy-in]/Таблица6917[Games],0)","v":0},{"$f":"IFERROR((Таблица6917[Profit]/Таблица6917[Buy-in])*100,0)","v":0},{"$f":"IFERROR((COUNTIFS(Таблица1[deni nedeli],Таблица6917[2019],Таблица1[Winnings],\">0\")/Таблица6917[Games])*100,0)","v":0},{"$f":"SUMIFS(Таблица1[Total Hands],Таблица1[deni nedeli],Таблица6917[[#This Row],[2019]])","v":0},{"$f":"IFERROR(SUMIFS(Таблица1[bb/101],Таблица1[deni nedeli],Таблица6917[[#This Row],[2019]])/Таблица6917[[#This Row],[Hand]],0)","v":0},{"$f":"IFERROR(SUMIFS(Таблица1[EV bb/101],Таблица1[deni nedeli],Таблица6917[[#This Row],[2019]])/Таблица6917[[#This Row],[Hand]],0)","v":0},{"$f":"SUMIFS(Таблица1[Net Winnings],Таблица1[deni nedeli],Таблица6917[2019])","v":0},{"$f":"IFERROR(Таблица6917[[#This Row],[Profit]]/Таблица6917[[#This Row],[Games]],0)","v":0}]

{"sheet":"buy-in","index":7,"n_rows":21,"n_cols":12,"rows_kept":21,"cut":false,"hidden":false,"merged":[]}
[]
[]
[null,"2019","Games","Buy-in","ABI","Roi","Itm","Hand","bb/100","EV bb/100","Profit","Pr/Game"]
[null,0.25,{"$f":"COUNTIFS(Таблица1[Buy-In],Таблица691711[[#This Row],[2019]])+SUMIFS(Таблица1[Re-entry],Таблица1[Buy-In],Таблица691711[[#This Row],[2019]])","v":4},{"$f":"SUMIFS(Таблица1[Total Buy-In],Таблица1[Buy-In],Таблица691711[[#This Row],[2019]])","v":1},{"$f":"IFERROR(Таблица691711[Buy-in]/Таблица691711[Games],0)","v":0.25},{"$f":"IFERROR((Таблица691711[Profit]/Таблица691711[Buy-in])*100,0)","v":223},{"$f":"IFERROR((COUNTIFS(Таблица1[Buy-In],Таблица691711[2019],Таблица1[Winnings],\">0\")/Таблица691711[Games])*100,0)","v":25},{"$f":"SUMIFS(Таблица1[Total Hands],Таблица1[Buy-In],Таблица691711[[#This Row],[2019]])","v":416},{"$f":"IFERROR(SUMIFS(Таблица1[bb/101],Таблица1[Buy-In],Таблица691711[[#This Row],[2019]])/Таблица691711[[#This Row],[Hand]],0)","v":18.658221153846153},{"$f":"IFERROR(SUMIFS(Таблица1[EV bb/101],Таблица1[Buy-In],Таблица691711[[#This Row],[2019]])/Таблица691711[[#This Row],[Hand]],0)","v":5.9914182692307678},{"$f":"SUMIFS(Таблица1[Net Winnings],Таблица1[Buy-In],Таблица691711[2019])","v":2.23},{"$f":"IFERROR(Таблица691711[[#This Row],[Profit]]/Таблица691711[[#This Row],[Games]],0)","v":0.5575}]
[null,0.5,{"$f":"COUNTIFS(Таблица1[Buy-In],Таблица691711[[#This Row],[2019]])+SUMIFS(Таблица1[Re-entry],Таблица1[Buy-In],Таблица691711[[#This Row],[2019]])","v":0},{"$f":"SUMIFS(Таблица1[Total Buy-In],Таблица1[Buy-In],Таблица691711[[#This Row],[2019]])","v":0},{"$f":"IFERROR(Таблица691711[Buy-in]/Таблица691711[Games],0)","v":0},{"$f":"IFERROR((Таблица691711[Profit]/Таблица691711[Buy-in])*100,0)","v":0},{"$f":"IFERROR((COUNTIFS(Таблица1[Buy-In],Таблица691711[2019],Таблица1[Winnings],\">0\")/Таблица691711[Games])*100,0)","v":0},{"$f":"SUMIFS(Таблица1[Total Hands],Таблица1[Buy-In],Таблица691711[[#This Row],[2019]])","v":0},{"$f":"IFERROR(SUMIFS(Таблица1[bb/101],Таблица1[Buy-In],Таблица691711[[#This Row],[2019]])/Таблица691711[[#This Row],[Hand]],0)","v":0},{"$f":"IFERROR(SUMIFS(Таблица1[EV bb/101],Таблица1[Buy-In],Таблица691711[[#This Row],[2019]])/Таблица691711[[#This Row],[Hand]],0)","v":0},{"$f":"SUMIFS(Таблица1[Net Winnings],Таблица1[Buy-In],Таблица691711[2019])","v":0},{"$f":"IFERROR(Таблица691711[[#This Row],[Profit]]/Таблица691711[[#This Row],[Games]],0)","v":0}]
[null,0.55000000000000004,{"$f":"COUNTIFS(Таблица1[Buy-In],Таблица691711[[#This Row],[2019]])+SUMIFS(Таблица1[Re-entry],Таблица1[Buy-In],Таблица691711[[#This Row],[2019]])","v":0},{"$f":"SUMIFS(Таблица1[Total Buy-In],Таблица1[Buy-In],Таблица691711[[#This Row],[2019]])","v":0},{"$f":"IFERROR(Таблица691711[Buy-in]/Таблица691711[Games],0)","v":0},{"$f":"IFERROR((Таблица691711[Profit]/Таблица691711[Buy-in])*100,0)","v":0},{"$f":"IFERROR((COUNTIFS(Таблица1[Buy-In],Таблица691711[2019],Таблица1[Winnings],\">0\")/Таблица691711[Games])*100,0)","v":0},{"$f":"SUMIFS(Таблица1[Total Hands],Таблица1[Buy-In],Таблица691711[[#This Row],[2019]])","v":0},{"$f":"IFERROR(SUMIFS(Таблица1[bb/101],Таблица1[Buy-In],Таблица691711[[#This Row],[2019]])/Таблица691711[[#This Row],[Hand]],0)","v":0},{"$f":"IFERROR(SUMIFS(Таблица1[EV bb/101],Таблица1[Buy-In],Таблица691711[[#This Row],[2019]])/Таблица691711[[#This Row],[Hand]],0)","v":0},{"$f":"SUMIFS(Таблица1[Net Winnings],Таблица1[Buy-In],Таблица691711[2019])","v":0},{"$f":"IFERROR(Таблица691711[[#This Row],[Profit]]/Таблица691711[[#This Row],[Games]],0)","v":0}]
[null,1,{"$f":"COUNTIFS(Таблица1[Buy-In],Таблица691711[[#This Row],[2019]])+SUMIFS(Таблица1[Re-entry],Таблица1[Buy-In],Таблица691711[[#This Row],[2019]])","v":0},{"$f":"SUMIFS(Таблица1[Total Buy-In],Таблица1[Buy-In],Таблица691711[[#This Row],[2019]])","v":0},{"$f":"IFERROR(Таблица691711[Buy-in]/Таблица691711[Games],0)","v":0},{"$f":"IFERROR((Таблица691711[Profit]/Таблица691711[Buy-in])*100,0)","v":0},{"$f":"IFERROR((COUNTIFS(Таблица1[Buy-In],Таблица691711[2019],Таблица1[Winnings],\">0\")/Таблица691711[Games])*100,0)","v":0},{"$f":"SUMIFS(Таблица1[Total Hands],Таблица1[Buy-In],Таблица691711[[#This Row],[2019]])","v":0},{"$f":"IFERROR(SUMIFS(Таблица1[bb/101],Таблица1[Buy-In],Таблица691711[[#This Row],[2019]])/Таблица691711[[#This Row],[Hand]],0)","v":0},{"$f":"IFERROR(SUMIFS(Таблица1[EV bb/101],Таблица1[Buy-In],Таблица691711[[#This Row],[2019]])/Таблица691711[[#This Row],[Hand]],0)","v":0},{"$f":"SUMIFS(Таблица1[Net Winnings],Таблица1[Buy-In],Таблица691711[2019])","v":0},{"$f":"IFERROR(Таблица691711[[#This Row],[Profit]]/Таблица691711[[#This Row],[Games]],0)","v":0}]
[null,1.1000000000000001,{"$f":"COUNTIFS(Таблица1[Buy-In],Таблица691711[[#This Row],[2019]])+SUMIFS(Таблица1[Re-entry],Таблица1[Buy-In],Таблица691711[[#This Row],[2019]])","v":0},{"$f":"SUMIFS(Таблица1[Total Buy-In],Таблица1[Buy-In],Таблица691711[[#This Row],[2019]])","v":0},{"$f":"IFERROR(Таблица691711[Buy-in]/Таблица691711[Games],0)","v":0},{"$f":"IFERROR((Таблица691711[Profit]/Таблица691711[Buy-in])*100,0)","v":0},{"$f":"IFERROR((COUNTIFS(Таблица1[Buy-In],Таблица691711[2019],Таблица1[Winnings],\">0\")/Таблица691711[Games])*100,0)","v":0},{"$f":"SUMIFS(Таблица1[Total Hands],Таблица1[Buy-In],Таблица691711[[#This Row],[2019]])","v":0},{"$f":"IFERROR(SUMIFS(Таблица1[bb/101],Таблица1[Buy-In],Таблица691711[[#This Row],[2019]])/Таблица691711[[#This Row],[Hand]],0)","v":0},{"$f":"IFERROR(SUMIFS(Таблица1[EV bb/101],Таблица1[Buy-In],Таблица691711[[#This Row],[2019]])/Таблица691711[[#This Row],[Hand]],0)","v":0},{"$f":"SUMIFS(Таблица1[Net Winnings],Таблица1[Buy-In],Таблица691711[2019])","v":0},{"$f":"IFERROR(Таблица691711[[#This Row],[Profit]]/Таблица691711[[#This Row],[Games]],0)","v":0}]
[null,2,{"$f":"COUNTIFS(Таблица1[Buy-In],Таблица691711[[#This Row],[2019]])+SUMIFS(Таблица1[Re-entry],Таблица1[Buy-In],Таблица691711[[#This Row],[2019]])","v":0},{"$f":"SUMIFS(Таблица1[Total Buy-In],Таблица1[Buy-In],Таблица691711[[#This Row],[2019]])","v":0},{"$f":"IFERROR(Таблица691711[Buy-in]/Таблица691711[Games],0)","v":0},{"$f":"IFERROR((Таблица691711[Profit]/Таблица691711[Buy-in])*100,0)","v":0},{"$f":"IFERROR((COUNTIFS(Таблица1[Buy-In],Таблица691711[2019],Таблица1[Winnings],\">0\")/Таблица691711[Games])*100,0)","v":0},{"$f":"SUMIFS(Таблица1[Total Hands],Таблица1[Buy-In],Таблица691711[[#This Row],[2019]])","v":0},{"$f":"IFERROR(SUMIFS(Таблица1[bb/101],Таблица1[Buy-In],Таблица691711[[#This Row],[2019]])/Таблица691711[[#This Row],[Hand]],0)","v":0},{"$f":"IFERROR(SUMIFS(Таблица1[EV bb/101],Таблица1[Buy-In],Таблица691711[[#This Row],[2019]])/Таблица691711[[#This Row],[Hand]],0)","v":0},{"$f":"SUMIFS(Таблица1[Net Winnings],Таблица1[Buy-In],Таблица691711[2019])","v":0},{"$f":"IFERROR(Таблица691711[[#This Row],[Profit]]/Таблица691711[[#This Row],[Games]],0)","v":0}]
[null,2.2000000000000002,{"$f":"COUNTIFS(Таблица1[Buy-In],Таблица691711[[#This Row],[2019]])+SUMIFS(Таблица1[Re-entry],Таблица1[Buy-In],Таблица691711[[#This Row],[2019]])","v":0},{"$f":"SUMIFS(Таблица1[Total Buy-In],Таблица1[Buy-In],Таблица691711[[#This Row],[2019]])","v":0},{"$f":"IFERROR(Таблица691711[Buy-in]/Таблица691711[Games],0)","v":0},{"$f":"IFERROR((Таблица691711[Profit]/Таблица691711[Buy-in])*100,0)","v":0},{"$f":"IFERROR((COUNTIFS(Таблица1[Buy-In],Таблица691711[2019],Таблица1[Winnings],\">0\")/Таблица691711[Games])*100,0)","v":0},{"$f":"SUMIFS(Таблица1[Total Hands],Таблица1[Buy-In],Таблица691711[[#This Row],[2019]])","v":0},{"$f":"IFERROR(SUMIFS(Таблица1[bb/101],Таблица1[Buy-In],Таблица691711[[#This Row],[2019]])/Таблица691711[[#This Row],[Hand]],0)","v":0},{"$f":"IFERROR(SUMIFS(Таблица1[EV bb/101],Таблица1[Buy-In],Таблица691711[[#This Row],[2019]])/Таблица691711[[#This Row],[Hand]],0)","v":0},{"$f":"SUMIFS(Таблица1[Net Winnings],Таблица1[Buy-In],Таблица691711[2019])","v":0},{"$f":"IFERROR(Таблица691711[[#This Row],[Profit]]/Таблица691711[[#This Row],[Games]],0)","v":0}]
[null,2.5,{"$f":"COUNTIFS(Таблица1[Buy-In],Таблица691711[[#This Row],[2019]])+SUMIFS(Таблица1[Re-entry],Таблица1[Buy-In],Таблица691711[[#This Row],[2019]])","v":0},{"$f":"SUMIFS(Таблица1[Total Buy-In],Таблица1[Buy-In],Таблица691711[[#This Row],[2019]])","v":0},{"$f":"IFERROR(Таблица691711[Buy-in]/Таблица691711[Games],0)","v":0},{"$f":"IFERROR((Таблица691711[Profit]/Таблица691711[Buy-in])*100,0)","v":0},{"$f":"IFERROR((COUNTIFS(Таблица1[Buy-In],Таблица691711[2019],Таблица1[Winnings],\">0\")/Таблица691711[Games])*100,0)","v":0},{"$f":"SUMIFS(Таблица1[Total Hands],Таблица1[Buy-In],Таблица691711[[#This Row],[2019]])","v":0},{"$f":"IFERROR(SUMIFS(Таблица1[bb/101],Таблица1[Buy-In],Таблица691711[[#This Row],[2019]])/Таблица691711[[#This Row],[Hand]],0)","v":0},{"$f":"IFERROR(SUMIFS(Таблица1[EV bb/101],Таблица1[Buy-In],Таблица691711[[#This Row],[2019]])/Таблица691711[[#This Row],[Hand]],0)","v":0},{"$f":"SUMIFS(Таблица1[Net Winnings],Таблица1[Buy-In],Таблица691711[2019])","v":0},{"$f":"IFERROR(Таблица691711[[#This Row],[Profit]]/Таблица691711[[#This Row],[Games]],0)","v":0}]
[null,3,{"$f":"COUNTIFS(Таблица1[Buy-In],Таблица691711[[#This Row],[2019]])+SUMIFS(Таблица1[Re-entry],Таблица1[Buy-In],Таблица691711[[#This Row],[2019]])","v":0},{"$f":"SUMIFS(Таблица1[Total Buy-In],Таблица1[Buy-In],Таблица691711[[#This Row],[2019]])","v":0},{"$f":"IFERROR(Таблица691711[Buy-in]/Таблица691711[Games],0)","v":0},{"$f":"IFERROR((Таблица691711[Profit]/Таблица691711[Buy-in])*100,0)","v":0},{"$f":"IFERROR((COUNTIFS(Таблица1[Buy-In],Таблица691711[2019],Таблица1[Winnings],\">0\")/Таблица691711[Games])*100,0)","v":0},{"$f":"SUMIFS(Таблица1[Total Hands],Таблица1[Buy-In],Таблица691711[[#This Row],[2019]])","v":0},{"$f":"IFERROR(SUMIFS(Таблица1[bb/101],Таблица1[Buy-In],Таблица691711[[#This Row],[2019]])/Таблица691711[[#This Row],[Hand]],0)","v":0},{"$f":"IFERROR(SUMIFS(Таблица1[EV bb/101],Таблица1[Buy-In],Таблица691711[[#This Row],[2019]])/Таблица691711[[#This Row],[Hand]],0)","v":0},{"$f":"SUMIFS(Таблица1[Net Winnings],Таблица1[Buy-In],Таблица691711[2019])","v":0},{"$f":"IFERROR(Таблица691711[[#This Row],[Profit]]/Таблица691711[[#This Row],[Games]],0)","v":0}]
[null,3.3,{"$f":"COUNTIFS(Таблица1[Buy-In],Таблица691711[[#This Row],[2019]])+SUMIFS(Таблица1[Re-entry],Таблица1[Buy-In],Таблица691711[[#This Row],[2019]])","v":0},{"$f":"SUMIFS(Таблица1[Total Buy-In],Таблица1[Buy-In],Таблица691711[[#This Row],[2019]])","v":0},{"$f":"IFERROR(Таблица691711[Buy-in]/Таблица691711[Games],0)","v":0},{"$f":"IFERROR((Таблица691711[Profit]/Таблица691711[Buy-in])*100,0)","v":0},{"$f":"IFERROR((COUNTIFS(Таблица1[Buy-In],Таблица691711[2019],Таблица1[Winnings],\">0\")/Таблица691711[Games])*100,0)","v":0},{"$f":"SUMIFS(Таблица1[Total Hands],Таблица1[Buy-In],Таблица691711[[#This Row],[2019]])","v":0},{"$f":"IFERROR(SUMIFS(Таблица1[bb/101],Таблица1[Buy-In],Таблица691711[[#This Row],[2019]])/Таблица691711[[#This Row],[Hand]],0)","v":0},{"$f":"IFERROR(SUMIFS(Таблица1[EV bb/101],Таблица1[Buy-In],Таблица691711[[#This Row],[2019]])/Таблица691711[[#This Row],[Hand]],0)","v":0},{"$f":"SUMIFS(Таблица1[Net Winnings],Таблица1[Buy-In],Таблица691711[2019])","v":0},{"$f":"IFERROR(Таблица691711[[#This Row],[Profit]]/Таблица691711[[#This Row],[Games]],0)","v":0}]
[null,4.4000000000000004,{"$f":"COUNTIFS(Таблица1[Buy-In],Таблица691711[[#This Row],[2019]])+SUMIFS(Таблица1[Re-entry],Таблица1[Buy-In],Таблица691711[[#This Row],[2019]])","v":0},{"$f":"SUMIFS(Таблица1[Total Buy-In],Таблица1[Buy-In],Таблица691711[[#This Row],[2019]])","v":0},{"$f":"IFERROR(Таблица691711[Buy-in]/Таблица691711[Games],0)","v":0},{"$f":"IFERROR((Таблица691711[Profit]/Таблица691711[Buy-in])*100,0)","v":0},{"$f":"IFERROR((COUNTIFS(Таблица1[Buy-In],Таблица691711[2019],Таблица1[Winnings],\">0\")/Таблица691711[Games])*100,0)","v":0},{"$f":"SUMIFS(Таблица1[Total Hands],Таблица1[Buy-In],Таблица691711[[#This Row],[2019]])","v":0},{"$f":"IFERROR(SUMIFS(Таблица1[bb/101],Таблица1[Buy-In],Таблица691711[[#This Row],[2019]])/Таблица691711[[#This Row],[Hand]],0)","v":0},{"$f":"IFERROR(SUMIFS(Таблица1[EV bb/101],Таблица1[Buy-In],Таблица691711[[#This Row],[2019]])/Таблица691711[[#This Row],[Hand]],0)","v":0},{"$f":"SUMIFS(Таблица1[Net Winnings],Таблица1[Buy-In],Таблица691711[2019])","v":0},{"$f":"IFERROR(Таблица691711[[#This Row],[Profit]]/Таблица691711[[#This Row],[Games]],0)","v":0}]
[null,5,{"$f":"COUNTIFS(Таблица1[Buy-In],Таблица691711[[#This Row],[2019]])+SUMIFS(Таблица1[Re-entry],Таблица1[Buy-In],Таблица691711[[#This Row],[2019]])","v":0},{"$f":"SUMIFS(Таблица1[Total Buy-In],Таблица1[Buy-In],Таблица691711[[#This Row],[2019]])","v":0},{"$f":"IFERROR(Таблица691711[Buy-in]/Таблица691711[Games],0)","v":0},{"$f":"IFERROR((Таблица691711[Profit]/Таблица691711[Buy-in])*100,0)","v":0},{"$f":"IFERROR((COUNTIFS(Таблица1[Buy-In],Таблица691711[2019],Таблица1[Winnings],\">0\")/Таблица691711[Games])*100,0)","v":0},{"$f":"SUMIFS(Таблица1[Total Hands],Таблица1[Buy-In],Таблица691711[[#This Row],[2019]])","v":0},{"$f":"IFERROR(SUMIFS(Таблица1[bb/101],Таблица1[Buy-In],Таблица691711[[#This Row],[2019]])/Таблица691711[[#This Row],[Hand]],0)","v":0},{"$f":"IFERROR(SUMIFS(Таблица1[EV bb/101],Таблица1[Buy-In],Таблица691711[[#This Row],[2019]])/Таблица691711[[#This Row],[Hand]],0)","v":0},{"$f":"SUMIFS(Таблица1[Net Winnings],Таблица1[Buy-In],Таблица691711[2019])","v":0},{"$f":"IFERROR(Таблица691711[[#This Row],[Profit]]/Таблица691711[[#This Row],[Games]],0)","v":0}]
[null,5.5,{"$f":"COUNTIFS(Таблица1[Buy-In],Таблица691711[[#This Row],[2019]])+SUMIFS(Таблица1[Re-entry],Таблица1[Buy-In],Таблица691711[[#This Row],[2019]])","v":0},{"$f":"SUMIFS(Таблица1[Total Buy-In],Таблица1[Buy-In],Таблица691711[[#This Row],[2019]])","v":0},{"$f":"IFERROR(Таблица691711[Buy-in]/Таблица691711[Games],0)","v":0},{"$f":"IFERROR((Таблица691711[Profit]/Таблица691711[Buy-in])*100,0)","v":0},{"$f":"IFERROR((COUNTIFS(Таблица1[Buy-In],Таблица691711[2019],Таблица1[Winnings],\">0\")/Таблица691711[Games])*100,0)","v":0},{"$f":"SUMIFS(Таблица1[Total Hands],Таблица1[Buy-In],Таблица691711[[#This Row],[2019]])","v":0},{"$f":"IFERROR(SUMIFS(Таблица1[bb/101],Таблица1[Buy-In],Таблица691711[[#This Row],[2019]])/Таблица691711[[#This Row],[Hand]],0)","v":0},{"$f":"IFERROR(SUMIFS(Таблица1[EV bb/101],Таблица1[Buy-In],Таблица691711[[#This Row],[2019]])/Таблица691711[[#This Row],[Hand]],0)","v":0},{"$f":"SUMIFS(Таблица1[Net Winnings],Таблица1[Buy-In],Таблица691711[2019])","v":0},{"$f":"IFERROR(Таблица691711[[#This Row],[Profit]]/Таблица691711[[#This Row],[Games]],0)","v":0}]
[null,7.5,{"$f":"COUNTIFS(Таблица1[Buy-In],Таблица691711[[#This Row],[2019]])+SUMIFS(Таблица1[Re-entry],Таблица1[Buy-In],Таблица691711[[#This Row],[2019]])","v":0},{"$f":"SUMIFS(Таблица1[Total Buy-In],Таблица1[Buy-In],Таблица691711[[#This Row],[2019]])","v":0},{"$f":"IFERROR(Таблица691711[Buy-in]/Таблица691711[Games],0)","v":0},{"$f":"IFERROR((Таблица691711[Profit]/Таблица691711[Buy-in])*100,0)","v":0},{"$f":"IFERROR((COUNTIFS(Таблица1[Buy-In],Таблица691711[2019],Таблица1[Winnings],\">0\")/Таблица691711[Games])*100,0)","v":0},{"$f":"SUMIFS(Таблица1[Total Hands],Таблица1[Buy-In],Таблица691711[[#This Row],[2019]])","v":0},{"$f":"IFERROR(SUMIFS(Таблица1[bb/101],Таблица1[Buy-In],Таблица691711[[#This Row],[2019]])/Таблица691711[[#This Row],[Hand]],0)","v":0},{"$f":"IFERROR(SUMIFS(Таблица1[EV bb/101],Таблица1[Buy-In],Таблица691711[[#This Row],[2019]])/Таблица691711[[#This Row],[Hand]],0)","v":0},{"$f":"SUMIFS(Таблица1[Net Winnings],Таблица1[Buy-In],Таблица691711[2019])","v":0},{"$f":"IFERROR(Таблица691711[[#This Row],[Profit]]/Таблица691711[[#This Row],[Games]],0)","v":0}]
[null,11,{"$f":"COUNTIFS(Таблица1[Buy-In],Таблица691711[[#This Row],[2019]])+SUMIFS(Таблица1[Re-entry],Таблица1[Buy-In],Таблица691711[[#This Row],[2019]])","v":0},{"$f":"SUMIFS(Таблица1[Total Buy-In],Таблица1[Buy-In],Таблица691711[[#This Row],[2019]])","v":0},{"$f":"IFERROR(Таблица691711[Buy-in]/Таблица691711[Games],0)","v":0},{"$f":"IFERROR((Таблица691711[Profit]/Таблица691711[Buy-in])*100,0)","v":0},{"$f":"IFERROR((COUNTIFS(Таблица1[Buy-In],Таблица691711[2019],Таблица1[Winnings],\">0\")/Таблица691711[Games])*100,0)","v":0},{"$f":"SUMIFS(Таблица1[Total Hands],Таблица1[Buy-In],Таблица691711[[#This Row],[2019]])","v":0},{"$f":"IFERROR(SUMIFS(Таблица1[bb/101],Таблица1[Buy-In],Таблица691711[[#This Row],[2019]])/Таблица691711[[#This Row],[Hand]],0)","v":0},{"$f":"IFERROR(SUMIFS(Таблица1[EV bb/101],Таблица1[Buy-In],Таблица691711[[#This Row],[2019]])/Таблица691711[[#This Row],[Hand]],0)","v":0},{"$f":"SUMIFS(Таблица1[Net Winnings],Таблица1[Buy-In],Таблица691711[2019])","v":0},{"$f":"IFERROR(Таблица691711[[#This Row],[Profit]]/Таблица691711[[#This Row],[Games]],0)","v":0}]
[null,12,{"$f":"COUNTIFS(Таблица1[Buy-In],Таблица691711[[#This Row],[2019]])+SUMIFS(Таблица1[Re-entry],Таблица1[Buy-In],Таблица691711[[#This Row],[2019]])","v":0},{"$f":"SUMIFS(Таблица1[Total Buy-In],Таблица1[Buy-In],Таблица691711[[#This Row],[2019]])","v":0},{"$f":"IFERROR(Таблица691711[Buy-in]/Таблица691711[Games],0)","v":0},{"$f":"IFERROR((Таблица691711[Profit]/Таблица691711[Buy-in])*100,0)","v":0},{"$f":"IFERROR((COUNTIFS(Таблица1[Buy-In],Таблица691711[2019],Таблица1[Winnings],\">0\")/Таблица691711[Games])*100,0)","v":0},{"$f":"SUMIFS(Таблица1[Total Hands],Таблица1[Buy-In],Таблица691711[[#This Row],[2019]])","v":0},{"$f":"IFERROR(SUMIFS(Таблица1[bb/101],Таблица1[Buy-In],Таблица691711[[#This Row],[2019]])/Таблица691711[[#This Row],[Hand]],0)","v":0},{"$f":"IFERROR(SUMIFS(Таблица1[EV bb/101],Таблица1[Buy-In],Таблица691711[[#This Row],[2019]])/Таблица691711[[#This Row],[Hand]],0)","v":0},{"$f":"SUMIFS(Таблица1[Net Winnings],Таблица1[Buy-In],Таблица691711[2019])","v":0},{"$f":"IFERROR(Таблица691711[[#This Row],[Profit]]/Таблица691711[[#This Row],[Games]],0)","v":0}]
[null,22,{"$f":"COUNTIFS(Таблица1[Buy-In],Таблица691711[[#This Row],[2019]])+SUMIFS(Таблица1[Re-entry],Таблица1[Buy-In],Таблица691711[[#This Row],[2019]])","v":0},{"$f":"SUMIFS(Таблица1[Total Buy-In],Таблица1[Buy-In],Таблица691711[[#This Row],[2019]])","v":0},{"$f":"IFERROR(Таблица691711[Buy-in]/Таблица691711[Games],0)","v":0},{"$f":"IFERROR((Таблица691711[Profit]/Таблица691711[Buy-in])*100,0)","v":0},{"$f":"IFERROR((COUNTIFS(Таблица1[Buy-In],Таблица691711[2019],Таблица1[Winnings],\">0\")/Таблица691711[Games])*100,0)","v":0},{"$f":"SUMIFS(Таблица1[Total Hands],Таблица1[Buy-In],Таблица691711[[#This Row],[2019]])","v":0},{"$f":"IFERROR(SUMIFS(Таблица1[bb/101],Таблица1[Buy-In],Таблица691711[[#This Row],[2019]])/Таблица691711[[#This Row],[Hand]],0)","v":0},{"$f":"IFERROR(SUMIFS(Таблица1[EV bb/101],Таблица1[Buy-In],Таблица691711[[#This Row],[2019]])/Таблица691711[[#This Row],[Hand]],0)","v":0},{"$f":"SUMIFS(Таблица1[Net Winnings],Таблица1[Buy-In],Таблица691711[2019])","v":0},{"$f":"IFERROR(Таблица691711[[#This Row],[Profit]]/Таблица691711[[#This Row],[Games]],0)","v":0}]
[null,50,{"$f":"COUNTIFS(Таблица1[Buy-In],Таблица691711[[#This Row],[2019]])+SUMIFS(Таблица1[Re-entry],Таблица1[Buy-In],Таблица691711[[#This Row],[2019]])","v":0},{"$f":"SUMIFS(Таблица1[Total Buy-In],Таблица1[Buy-In],Таблица691711[[#This Row],[2019]])","v":0},{"$f":"IFERROR(Таблица691711[Buy-in]/Таблица691711[Games],0)","v":0},{"$f":"IFERROR((Таблица691711[Profit]/Таблица691711[Buy-in])*100,0)","v":0},{"$f":"IFERROR((COUNTIFS(Таблица1[Buy-In],Таблица691711[2019],Таблица1[Winnings],\">0\")/Таблица691711[Games])*100,0)","v":0},{"$f":"SUMIFS(Таблица1[Total Hands],Таблица1[Buy-In],Таблица691711[[#This Row],[2019]])","v":0},{"$f":"IFERROR(SUMIFS(Таблица1[bb/101],Таблица1[Buy-In],Таблица691711[[#This Row],[2019]])/Таблица691711[[#This Row],[Hand]],0)","v":0},{"$f":"IFERROR(SUMIFS(Таблица1[EV bb/101],Таблица1[Buy-In],Таблица691711[[#This Row],[2019]])/Таблица691711[[#This Row],[Hand]],0)","v":0},{"$f":"SUMIFS(Таблица1[Net Winnings],Таблица1[Buy-In],Таблица691711[2019])","v":0},{"$f":"IFERROR(Таблица691711[[#This Row],[Profit]]/Таблица691711[[#This Row],[Games]],0)","v":0}]

{"sheet":"месяц","index":8,"n_rows":15,"n_cols":12,"rows_kept":15,"cut":false,"hidden":false,"merged":[]}
[]
[]
[null,"2019","Games","Buy-in","ABI","Roi","Itm","Hand","bb/100","EV bb/100","Profit","Pr/Game"]
[null,"январь",{"$f":"COUNTIFS(Таблица1[Meset],Таблица69[[#This Row],[2019]])+SUMIFS(Таблица1[Re-entry],Таблица1[Meset],Таблица69[[#This Row],[2019]])","v":0},{"$f":"SUMIFS(Таблица1[Total Buy-In],Таблица1[Meset],Таблица69[[#This Row],[2019]])","v":0},{"$f":"IFERROR(Таблица69[Buy-in]/Таблица69[Games],0)","v":0},{"$f":"IFERROR((Таблица69[Profit]/Таблица69[Buy-in])*100,0)","v":0},{"$f":"IFERROR((COUNTIFS(Таблица1[Meset],Таблица69[2019],Таблица1[Winnings],\">0\")/Таблица69[Games])*100,0)","v":0},{"$f":"SUMIFS(Таблица1[Total Hands],Таблица1[Meset],Таблица69[[#This Row],[2019]])","v":0},{"$f":"IFERROR(SUMIFS(Таблица1[bb/101],Таблица1[Meset],Таблица69[[#This Row],[2019]])/Таблица69[[#This Row],[Hand]],0)","v":0},{"$f":"IFERROR(SUMIFS(Таблица1[EV bb/101],Таблица1[Meset],Таблица69[[#This Row],[2019]])/Таблица69[[#This Row],[Hand]],0)","v":0},{"$f":"SUMIFS(Таблица1[Net Winnings],Таблица1[Meset],Таблица69[2019])","v":0},{"$f":"IFERROR(Таблица69[[#This Row],[Profit]]/Таблица69[[#This Row],[Games]],0)","v":0}]
[null,"февраль",{"$f":"COUNTIFS(Таблица1[Meset],Таблица69[[#This Row],[2019]])+SUMIFS(Таблица1[Re-entry],Таблица1[Meset],Таблица69[[#This Row],[2019]])","v":0},{"$f":"SUMIFS(Таблица1[Total Buy-In],Таблица1[Meset],Таблица69[[#This Row],[2019]])","v":0},{"$f":"IFERROR(Таблица69[Buy-in]/Таблица69[Games],0)","v":0},{"$f":"IFERROR((Таблица69[Profit]/Таблица69[Buy-in])*100,0)","v":0},{"$f":"IFERROR((COUNTIFS(Таблица1[Meset],Таблица69[2019],Таблица1[Winnings],\">0\")/Таблица69[Games])*100,0)","v":0},{"$f":"SUMIFS(Таблица1[Total Hands],Таблица1[Meset],Таблица69[[#This Row],[2019]])","v":0},{"$f":"IFERROR(SUMIFS(Таблица1[bb/101],Таблица1[Meset],Таблица69[[#This Row],[2019]])/Таблица69[[#This Row],[Hand]],0)","v":0},{"$f":"IFERROR(SUMIFS(Таблица1[EV bb/101],Таблица1[Meset],Таблица69[[#This Row],[2019]])/Таблица69[[#This Row],[Hand]],0)","v":0},{"$f":"SUMIFS(Таблица1[Net Winnings],Таблица1[Meset],Таблица69[2019])","v":0},{"$f":"IFERROR(Таблица69[[#This Row],[Profit]]/Таблица69[[#This Row],[Games]],0)","v":0}]
[null,"март",{"$f":"COUNTIFS(Таблица1[Meset],Таблица69[[#This Row],[2019]])+SUMIFS(Таблица1[Re-entry],Таблица1[Meset],Таблица69[[#This Row],[2019]])","v":0},{"$f":"SUMIFS(Таблица1[Total Buy-In],Таблица1[Meset],Таблица69[[#This Row],[2019]])","v":0},{"$f":"IFERROR(Таблица69[Buy-in]/Таблица69[Games],0)","v":0},{"$f":"IFERROR((Таблица69[Profit]/Таблица69[Buy-in])*100,0)","v":0},{"$f":"IFERROR((COUNTIFS(Таблица1[Meset],Таблица69[2019],Таблица1[Winnings],\">0\")/Таблица69[Games])*100,0)","v":0},{"$f":"SUMIFS(Таблица1[Total Hands],Таблица1[Meset],Таблица69[[#This Row],[2019]])","v":0},{"$f":"IFERROR(SUMIFS(Таблица1[bb/101],Таблица1[Meset],Таблица69[[#This Row],[2019]])/Таблица69[[#This Row],[Hand]],0)","v":0},{"$f":"IFERROR(SUMIFS(Таблица1[EV bb/101],Таблица1[Meset],Таблица69[[#This Row],[2019]])/Таблица69[[#This Row],[Hand]],0)","v":0},{"$f":"SUMIFS(Таблица1[Net Winnings],Таблица1[Meset],Таблица69[2019])","v":0},{"$f":"IFERROR(Таблица69[[#This Row],[Profit]]/Таблица69[[#This Row],[Games]],0)","v":0}]
[null,"апрель",{"$f":"COUNTIFS(Таблица1[Meset],Таблица69[[#This Row],[2019]])+SUMIFS(Таблица1[Re-entry],Таблица1[Meset],Таблица69[[#This Row],[2019]])","v":0},{"$f":"SUMIFS(Таблица1[Total Buy-In],Таблица1[Meset],Таблица69[[#This Row],[2019]])","v":0},{"$f":"IFERROR(Таблица69[Buy-in]/Таблица69[Games],0)","v":0},{"$f":"IFERROR((Таблица69[Profit]/Таблица69[Buy-in])*100,0)","v":0},{"$f":"IFERROR((COUNTIFS(Таблица1[Meset],Таблица69[2019],Таблица1[Winnings],\">0\")/Таблица69[Games])*100,0)","v":0},{"$f":"SUMIFS(Таблица1[Total Hands],Таблица1[Meset],Таблица69[[#This Row],[2019]])","v":0},{"$f":"IFERROR(SUMIFS(Таблица1[bb/101],Таблица1[Meset],Таблица69[[#This Row],[2019]])/Таблица69[[#This Row],[Hand]],0)","v":0},{"$f":"IFERROR(SUMIFS(Таблица1[EV bb/101],Таблица1[Meset],Таблица69[[#This Row],[2019]])/Таблица69[[#This Row],[Hand]],0)","v":0},{"$f":"SUMIFS(Таблица1[Net Winnings],Таблица1[Meset],Таблица69[2019])","v":0},{"$f":"IFERROR(Таблица69[[#This Row],[Profit]]/Таблица69[[#This Row],[Games]],0)","v":0}]
[null,"май",{"$f":"COUNTIFS(Таблица1[Meset],Таблица69[[#This Row],[2019]])+SUMIFS(Таблица1[Re-entry],Таблица1[Meset],Таблица69[[#This Row],[2019]])","v":0},{"$f":"SUMIFS(Таблица1[Total Buy-In],Таблица1[Meset],Таблица69[[#This Row],[2019]])","v":0},{"$f":"IFERROR(Таблица69[Buy-in]/Таблица69[Games],0)","v":0},{"$f":"IFERROR((Таблица69[Profit]/Таблица69[Buy-in])*100,0)","v":0},{"$f":"IFERROR((COUNTIFS(Таблица1[Meset],Таблица69[2019],Таблица1[Winnings],\">0\")/Таблица69[Games])*100,0)","v":0},{"$f":"SUMIFS(Таблица1[Total Hands],Таблица1[Meset],Таблица69[[#This Row],[2019]])","v":0},{"$f":"IFERROR(SUMIFS(Таблица1[bb/101],Таблица1[Meset],Таблица69[[#This Row],[2019]])/Таблица69[[#This Row],[Hand]],0)","v":0},{"$f":"IFERROR(SUMIFS(Таблица1[EV bb/101],Таблица1[Meset],Таблица69[[#This Row],[2019]])/Таблица69[[#This Row],[Hand]],0)","v":0},{"$f":"SUMIFS(Таблица1[Net Winnings],Таблица1[Meset],Таблица69[2019])","v":0},{"$f":"IFERROR(Таблица69[[#This Row],[Profit]]/Таблица69[[#This Row],[Games]],0)","v":0}]
[null,"июнь",{"$f":"COUNTIFS(Таблица1[Meset],Таблица69[[#This Row],[2019]])+SUMIFS(Таблица1[Re-entry],Таблица1[Meset],Таблица69[[#This Row],[2019]])","v":0},{"$f":"SUMIFS(Таблица1[Total Buy-In],Таблица1[Meset],Таблица69[[#This Row],[2019]])","v":0},{"$f":"IFERROR(Таблица69[Buy-in]/Таблица69[Games],0)","v":0},{"$f":"IFERROR((Таблица69[Profit]/Таблица69[Buy-in])*100,0)","v":0},{"$f":"IFERROR((COUNTIFS(Таблица1[Meset],Таблица69[2019],Таблица1[Winnings],\">0\")/Таблица69[Games])*100,0)","v":0},{"$f":"SUMIFS(Таблица1[Total Hands],Таблица1[Meset],Таблица69[[#This Row],[2019]])","v":0},{"$f":"IFERROR(SUMIFS(Таблица1[bb/101],Таблица1[Meset],Таблица69[[#This Row],[2019]])/Таблица69[[#This Row],[Hand]],0)","v":0},{"$f":"IFERROR(SUMIFS(Таблица1[EV bb/101],Таблица1[Meset],Таблица69[[#This Row],[2019]])/Таблица69[[#This Row],[Hand]],0)","v":0},{"$f":"SUMIFS(Таблица1[Net Winnings],Таблица1[Meset],Таблица69[2019])","v":0},{"$f":"IFERROR(Таблица69[[#This Row],[Profit]]/Таблица69[[#This Row],[Games]],0)","v":0}]
[null,"июль",{"$f":"COUNTIFS(Таблица1[Meset],Таблица69[[#This Row],[2019]])+SUMIFS(Таблица1[Re-entry],Таблица1[Meset],Таблица69[[#This Row],[2019]])","v":4},{"$f":"SUMIFS(Таблица1[Total Buy-In],Таблица1[Meset],Таблица69[[#This Row],[2019]])","v":1},{"$f":"IFERROR(Таблица69[Buy-in]/Таблица69[Games],0)","v":0.25},{"$f":"IFERROR((Таблица69[Profit]/Таблица69[Buy-in])*100,0)","v":223},{"$f":"IFERROR((COUNTIFS(Таблица1[Meset],Таблица69[2019],Таблица1[Winnings],\">0\")/Таблица69[Games])*100,0)","v":25},{"$f":"SUMIFS(Таблица1[Total Hands],Таблица1[Meset],Таблица69[[#This Row],[2019]])","v":416},{"$f":"IFERROR(SUMIFS(Таблица1[bb/101],Таблица1[Meset],Таблица69[[#This Row],[2019]])/Таблица69[[#This Row],[Hand]],0)","v":18.658221153846153},{"$f":"IFERROR(SUMIFS(Таблица1[EV bb/101],Таблица1[Meset],Таблица69[[#This Row],[2019]])/Таблица69[[#This Row],[Hand]],0)","v":5.9914182692307678},{"$f":"SUMIFS(Таблица1[Net Winnings],Таблица1[Meset],Таблица69[2019])","v":2.23},{"$f":"IFERROR(Таблица69[[#This Row],[Profit]]/Таблица69[[#This Row],[Games]],0)","v":0.5575}]
[null,"август",{"$f":"COUNTIFS(Таблица1[Meset],Таблица69[[#This Row],[2019]])+SUMIFS(Таблица1[Re-entry],Таблица1[Meset],Таблица69[[#This Row],[2019]])","v":0},{"$f":"SUMIFS(Таблица1[Total Buy-In],Таблица1[Meset],Таблица69[[#This Row],[2019]])","v":0},{"$f":"IFERROR(Таблица69[Buy-in]/Таблица69[Games],0)","v":0},{"$f":"IFERROR((Таблица69[Profit]/Таблица69[Buy-in])*100,0)","v":0},{"$f":"IFERROR((COUNTIFS(Таблица1[Meset],Таблица69[2019],Таблица1[Winnings],\">0\")/Таблица69[Games])*100,0)","v":0},{"$f":"SUMIFS(Таблица1[Total Hands],Таблица1[Meset],Таблица69[[#This Row],[2019]])","v":0},{"$f":"IFERROR(SUMIFS(Таблица1[bb/101],Таблица1[Meset],Таблица69[[#This Row],[2019]])/Таблица69[[#This Row],[Hand]],0)","v":0},{"$f":"IFERROR(SUMIFS(Таблица1[EV bb/101],Таблица1[Meset],Таблица69[[#This Row],[2019]])/Таблица69[[#This Row],[Hand]],0)","v":0},{"$f":"SUMIFS(Таблица1[Net Winnings],Таблица1[Meset],Таблица69[2019])","v":0},{"$f":"IFERROR(Таблица69[[#This Row],[Profit]]/Таблица69[[#This Row],[Games]],0)","v":0}]
[null,"сентябрь",{"$f":"COUNTIFS(Таблица1[Meset],Таблица69[[#This Row],[2019]])+SUMIFS(Таблица1[Re-entry],Таблица1[Meset],Таблица69[[#This Row],[2019]])","v":0},{"$f":"SUMIFS(Таблица1[Total Buy-In],Таблица1[Meset],Таблица69[[#This Row],[2019]])","v":0},{"$f":"IFERROR(Таблица69[Buy-in]/Таблица69[Games],0)","v":0},{"$f":"IFERROR((Таблица69[Profit]/Таблица69[Buy-in])*100,0)","v":0},{"$f":"IFERROR((COUNTIFS(Таблица1[Meset],Таблица69[2019],Таблица1[Winnings],\">0\")/Таблица69[Games])*100,0)","v":0},{"$f":"SUMIFS(Таблица1[Total Hands],Таблица1[Meset],Таблица69[[#This Row],[2019]])","v":0},{"$f":"IFERROR(SUMIFS(Таблица1[bb/101],Таблица1[Meset],Таблица69[[#This Row],[2019]])/Таблица69[[#This Row],[Hand]],0)","v":0},{"$f":"IFERROR(SUMIFS(Таблица1[EV bb/101],Таблица1[Meset],Таблица69[[#This Row],[2019]])/Таблица69[[#This Row],[Hand]],0)","v":0},{"$f":"SUMIFS(Таблица1[Net Winnings],Таблица1[Meset],Таблица69[2019])","v":0},{"$f":"IFERROR(Таблица69[[#This Row],[Profit]]/Таблица69[[#This Row],[Games]],0)","v":0}]
[null,"октябрь",{"$f":"COUNTIFS(Таблица1[Meset],Таблица69[[#This Row],[2019]])+SUMIFS(Таблица1[Re-entry],Таблица1[Meset],Таблица69[[#This Row],[2019]])","v":0},{"$f":"SUMIFS(Таблица1[Total Buy-In],Таблица1[Meset],Таблица69[[#This Row],[2019]])","v":0},{"$f":"IFERROR(Таблица69[Buy-in]/Таблица69[Games],0)","v":0},{"$f":"IFERROR((Таблица69[Profit]/Таблица69[Buy-in])*100,0)","v":0},{"$f":"IFERROR((COUNTIFS(Таблица1[Meset],Таблица69[2019],Таблица1[Winnings],\">0\")/Таблица69[Games])*100,0)","v":0},{"$f":"SUMIFS(Таблица1[Total Hands],Таблица1[Meset],Таблица69[[#This Row],[2019]])","v":0},{"$f":"IFERROR(SUMIFS(Таблица1[bb/101],Таблица1[Meset],Таблица69[[#This Row],[2019]])/Таблица69[[#This Row],[Hand]],0)","v":0},{"$f":"IFERROR(SUMIFS(Таблица1[EV bb/101],Таблица1[Meset],Таблица69[[#This Row],[2019]])/Таблица69[[#This Row],[Hand]],0)","v":0},{"$f":"SUMIFS(Таблица1[Net Winnings],Таблица1[Meset],Таблица69[2019])","v":0},{"$f":"IFERROR(Таблица69[[#This Row],[Profit]]/Таблица69[[#This Row],[Games]],0)","v":0}]
[null,"ноябрь",{"$f":"COUNTIFS(Таблица1[Meset],Таблица69[[#This Row],[2019]])+SUMIFS(Таблица1[Re-entry],Таблица1[Meset],Таблица69[[#This Row],[2019]])","v":0},{"$f":"SUMIFS(Таблица1[Total Buy-In],Таблица1[Meset],Таблица69[[#This Row],[2019]])","v":0},{"$f":"IFERROR(Таблица69[Buy-in]/Таблица69[Games],0)","v":0},{"$f":"IFERROR((Таблица69[Profit]/Таблица69[Buy-in])*100,0)","v":0},{"$f":"IFERROR((COUNTIFS(Таблица1[Meset],Таблица69[2019],Таблица1[Winnings],\">0\")/Таблица69[Games])*100,0)","v":0},{"$f":"SUMIFS(Таблица1[Total Hands],Таблица1[Meset],Таблица69[[#This Row],[2019]])","v":0},{"$f":"IFERROR(SUMIFS(Таблица1[bb/101],Таблица1[Meset],Таблица69[[#This Row],[2019]])/Таблица69[[#This Row],[Hand]],0)","v":0},{"$f":"IFERROR(SUMIFS(Таблица1[EV bb/101],Таблица1[Meset],Таблица69[[#This Row],[2019]])/Таблица69[[#This Row],[Hand]],0)","v":0},{"$f":"SUMIFS(Таблица1[Net Winnings],Таблица1[Meset],Таблица69[2019])","v":0},{"$f":"IFERROR(Таблица69[[#This Row],[Profit]]/Таблица69[[#This Row],[Games]],0)","v":0}]
[null,"декабрь",{"$f":"COUNTIFS(Таблица1[Meset],Таблица69[[#This Row],[2019]])+SUMIFS(Таблица1[Re-entry],Таблица1[Meset],Таблица69[[#This Row],[2019]])","v":0},{"$f":"SUMIFS(Таблица1[Total Buy-In],Таблица1[Meset],Таблица69[[#This Row],[2019]])","v":0},{"$f":"IFERROR(Таблица69[Buy-in]/Таблица69[Games],0)","v":0},{"$f":"IFERROR((Таблица69[Profit]/Таблица69[Buy-in])*100,0)","v":0},{"$f":"IFERROR((COUNTIFS(Таблица1[Meset],Таблица69[2019],Таблица1[Winnings],\">0\")/Таблица69[Games])*100,0)","v":0},{"$f":"SUMIFS(Таблица1[Total Hands],Таблица1[Meset],Таблица69[[#This Row],[2019]])","v":0},{"$f":"IFERROR(SUMIFS(Таблица1[bb/101],Таблица1[Meset],Таблица69[[#This Row],[2019]])/Таблица69[[#This Row],[Hand]],0)","v":0},{"$f":"IFERROR(SUMIFS(Таблица1[EV bb/101],Таблица1[Meset],Таблица69[[#This Row],[2019]])/Таблица69[[#This Row],[Hand]],0)","v":0},{"$f":"SUMIFS(Таблица1[Net Winnings],Таблица1[Meset],Таблица69[2019])","v":0},{"$f":"IFERROR(Таблица69[[#This Row],[Profit]]/Таблица69[[#This Row],[Games]],0)","v":0}]